Alvin vocabulary
type: Ontology
issued: 2026-03-12
modified: 2026-03-12
description: Alvin's data model is specifically designed for descriptions of materials in cultural heritage collections in libraries, museums and archives. In order to be able to handle different types of resources in one and the same system, it is based on a combination of concepts from different international standards for libraries and archives including BIBFRAME, MODS, MARC, EAD, TEI, NUDS, MADS, METS, PREMIS, WGS 84 and ISO 8601. The model is built around five basic core classes: Record (a bibliographic record that describes a single item or a collection of items), Person, Organisation, Place, Work and Location (the archival institution that holds the object or from which it is available).
creator: Uppsala university library
publisher: Uppsala university library
rights: https://creativecommons.org/publicdomain/zero/1.0/
license: https://creativecommons.org/publicdomain/zero/1.0/

Address
type: Class
label: Adress @sv
label: Adresse @no
definition: Adress. MADS - address @sv
definition: Address. MADS - address
definition: Adresse. MADS - address @no
modified: 2026-03-12

Administrative metadata
type: Class
label: Administrativ metadata @sv
definition: Metadata om metadata. BIBFRAME - adminMetadata @sv
definition: Metadata about the metadata. BIBFRAME - adminMetadata
definition: Metadata om metadataene. BIBFRAME - adminMetadata @no
modified: 2026-03-12

Agent
type: Class
definition: Enhet som har en roll i en resurs, till exempel en person eller organisation. BIBFRAME - Agent @sv
definition: Entity having a role in a resource, such as a person or organisation. BIBFRAME - Agent
definition: Enhet som har en rolle i en ressurs, for eksempel en person eller organisasjon. BIBFRAME - Agent @no
modified: 2026-03-12

Technique
type: Class
label: Teknik @sv
label: Teknikk @no
definition: Fysiskt eller kemiskt ämne applicerat på ett basmaterial av en resurs. BIBFRAME - AppliedMaterial @sv
definition: Physical or chemical substance applied to a base material of a resource. BIBFRAME - AppliedMaterial
definition: Fysisk eller kjemisk stoff påført et grunnmateriale av en ressurs. BIBFRAME - AppliedMaterial @no
scope note: appliedMaterialCollection
modified: 2026-03-12

Value
type: Class
label: Valör @sv
label: Verdi @no
definition: Valören för objektet. NUDS - appraisal @sv
definition: The appraisal of the object. NUDS - appraisal
definition: Vurdering av objektet. NUDS - appraisal @no
modified: 2026-03-12

Authority
type: Class
label: Auktoritet @sv
label: Autoritet @no
definition: En behållare som innehåller en standardiserad auktoriserad form av namn. MADS - authority @sv
definition: A container that includes a standardised authoritative form. MADS - authority
definition: En beholder som inkluderer en standardisert autorisert form for navn. MADS - authority @no
modified: 2026-03-12

Axis
type: Class
label: Stampställning @sv
label: Stampstilling @no
definition: Orienteringen av åtsidan till frånsidan. NUDS - axis @sv
definition: The orientation of the obverse to the reverse. NUDS - axis
definition: Orienteringen av forsiden til baksiden. NUDS - axis @no
modified: 2026-03-12

Material
type: Class
label: Materiale @no
definition: Underliggande fysiskt material för en resurs. BIBFRAME - BaseMaterial @sv
definition: Underlying physical material of a resource. BIBFRAME - BaseMaterial
definition: Underliggende fysisk materiale til en ressurs. BIBFRAME - BaseMaterial @no
scope note: baseMaterialCollection
modified: 2026-03-12

Book binding
type: Class
label: Bokband @sv
label: Bokbind @no
definition: Beskriver nuvarande och tidigare bindningar av ett manuskript eller annat föremål. TEI - bindingDesc @sv
definition: Describes the present and former bindings of a manuscript or other object. TEI - bindingDesc
definition: Beskriver nåværende og tidligere bindinger av et manuskript eller annen gjenstand. TEI - bindingDesc @no
modified: 2026-03-12

Place of birth
type: Class
label: Födelseort @sv
label: Fødested @no
definition: En stad eller ort där en person föddes. MADS - birthPlace @sv
definition: A city or place in which a person was born. MADS - birthPlace
definition: En by eller et sted hvor en person ble født. MADS - birthPlace @no
modified: 2026-03-12

Cartographic data
type: Class
label: Kartografiska data @sv
label: Kartografiske data @no
definition: Kartografiska data som identifierar egenskaper hos resursen, såsom koordinater, projektion, etc. BIBFRAME - cartographicAttributes @sv
definition: Cartographic data that identifies characteristics of the resource, such as coordinates, projection, etc. BIBFRAME - cartographicAttributes
definition: Kartografiske data som identifiserer egenskapene til ressursen, som koordinater, projeksjon osv. BIBFRAME - cartographicAttributes @no
modified: 2026-03-12

Uncertain information
type: Class
label: Osäker uppgift @sv
label: Usikker informasjon @no
definition: Indikerar graden av säkerhet förknippad med någon aspekt av texten. TEI - certainty @sv
definition: Indicates the degree of certainty associated with some aspect of the text. TEI - certainty
definition: Angir graden av sikkerhet knyttet til enkelte aspekter av teksten. TEI - certainty @no
scope note: certaintyCollection
modified: 2026-03-12

Checksum
type: Class
label: Kontrollsumma @sv
label: Sjekksum @no
definition: Tillhandahåller ett värde för kontrollsumma för den associerade filen. METS - @CHECKSUM @sv
definition: Provides a checksum value for the associated file. METS - @CHECKSUM
definition: Gir en sjekksumverdi for den tilknyttede filen. METS - @CHECKSUM @no
modified: 2026-03-12

Classification
type: Class
label: Klassifikation @sv
label: Klassifisering @no
definition: Klassificeringsnummer i valfritt schema. BIBFRAME - classification @sv
definition: Classification number in any scheme. BIBFRAME - classification
definition: Klassifikasjonsnummer i ethvert skjema. BIBFRAME - classification @no
modified: 2026-03-12

Clock
type: Class
label: Klocka @sv
label: Klokke @no
definition: Klockställning. NUDS - axis/@clock @sv
definition: Clock designation. NUDS - axis/@clock
definition: Klokkestilling. NUDS - axis/@clock @no
scope note: clockCollection
modified: 2026-03-12

Collection
type: Class
label: Samling @sv
definition: En sammansatt grupp av föremål som inte ursprungligen publicerades, distribuerades eller producerades tillsammans. MODS - typeOfResource/@collection @sv
definition: A made-up multipart group of items that were not originally published, distributed, or produced together. MODS - typeOfResource/@collection
definition: En sammensatt gruppe av gjenstander som ikke opprinnelig ble publisert, distribuert eller produsert sammen. MODS - typeOfResource/@collection @no
scope note: collectionCollection
modified: 2026-03-12

Component
type: Class
label: Komponent @sv
definition: Ett element som betecknar en underordnad del av materialet som beskrivs. EAD - c @sv
definition: An element that designates a subordinate part of the materials being described. EAD - c
definition: Et element som betegner en underordnet del av materialet som beskrives. EAD - c @no
modified: 2026-03-12

Conservation state
type: Class
label: Kondition @sv
label: Konservasjonstilstand @no
definition: De fysiska tillstånden för bevarande av ett föremål. NUDS - conservationState @sv
definition: The physical states of conservation of an object. NUDS - conservationState
definition: De fysiske tilstandene for bevaring av et objekt. NUDS - conservationState @no
scope note: conservationStateCollection
modified: 2026-03-12

Country
type: Class
label: Land @sv
definition: Landkod. MARC21 - 008/15-17 @sv
definition: Country code. MARC21 - 008/15-17
definition: Landekod. MARC21 - 008/15-17 @no
scope note: countryCollection
modified: 2026-03-12

Date
type: Class
label: Datum @sv
label: Dato @no
definition: En tidpunkt angiven med år, månad och dag enligt ISO 8601, YYYY-MM-DD. BIBFRAME - date @sv
definition: A point in time entered as year, month, and day according to ISO 8601, YYYY-MM-DD. BIBFRAME - date
definition: En tid angitt med år, måned og dag iht ISO 8601, YYYY-MM-DD. BIBFRAME - date @no
modified: 2026-03-12

Other years/dates
type: Class
label: Övriga år/datum @sv
label: Andre år/datoer @no
definition: Ett datum som inte tillhör någon annan kategori men som är viktigt att registrera. MODS - dateOther @sv
definition: A date that does not fall into another category but is important to record. MODS - dateOther
definition: En dato som ikke faller inn i en annen kategori, men som er viktig å registrere. MODS - dateOther @no
modified: 2026-03-12

Type
type: Class
label: Typ @sv
definition: Attribut för att ange en specifik typ av datum som inte ansågs ha tillräcklig allmän användning för att ha ett eget datumelement. MODS - @type @sv
definition: Attribute to designate a specific kind of date which was not deemed of sufficient general use to have its own date element. MODS - @type
definition: Attributt for å angi en bestemt type dato som ikke ble ansett for tilstrekkelig generell bruk til å ha sitt eget datoelement. MODS - @type @no
scope note: dateTypeCollection
modified: 2026-03-12

Place of death
type: Class
label: Dödsort @sv
label: Dødssted @no
definition: En stad eller ort där en person dog. MADS - deathPlace @sv
definition: A city or place where a person died. MADS - deathPlace
definition: En by eller sted der en person døde. MADS - deathPlace @no
modified: 2026-03-12

Description language
type: Class
label: Beskrivningsspråk @sv
label: Beskrivelsesspråk @no
definition: Språk som används för metadata. BIBFRAME - descriptionLanguage @sv
definition: Language used for the metadata. BIBFRAME - descriptionLanguage
definition: Språk som brukes for metadataene. BIBFRAME - descriptionLanguage @no
scope note: languageCollection
modified: 2026-03-12

Subordinate components
type: Class
label: Underordnade komponenter @sv
label: Underordnede komponenter @no
definition: Ett containerelement som samlar information om de hierarkiska grupperingarna av materialet som beskrivs. EAD - dsc @sv
definition: A wrapper element that bundles information about the hierarchical groupings of the materials being described. EAD - dsc
definition: Et beholderelement som samler informasjon om de hierarkiske grupperingene til materialet som beskrives. EAD - dsc @no
modified: 2026-03-12

Member type
type: Class
label: Medlemstyp @sv
label: Medlemstype @no
definition: Beskrivning. MADS - descriptor @sv
definition: Descriptor. MADS - descriptor
definition: Beskrivelse. MADS - descriptor @no
scope note: descriptorCollection
modified: 2026-03-12

Digital origin
type: Class
label: Digitalt ursprung @sv
label: Digitalt opphav @no
definition: Metoden genom vilken resursen fick digital form. MODS - PhysicalDescription/ digitalOrigin @sv
definition: The method by which the resource achieved digital form. MODS - physicalDescription/ digitalOrigin
definition: Metoden som ressursen fikk digital form på. MODS - physicalDescription/ digitalOrigin @no
scope note: digitalOriginCollection
modified: 2026-03-12

Measure
type: Class
label: Mått @sv
label: Mål @no
definition: Mått på bäraren eller bärarna och/eller behållaren för en resurs. BIBFRAME - dimensions @sv
definition: Measurements of the carrier or carriers and/or the container of a resource. BIBFRAME - dimensions
definition: Dimensjoner på bæreren eller bærerne og/eller beholderen til en ressurs. BIBFRAME - dimensions @no
modified: 2026-03-12

Edge description
type: Class
label: Randtyp @sv
label: Randbeskrivelse @no
definition: Ett containerelement för metadata om kanten. NUDS - edge @sv
definition: A container element for metadata about the edge. NUDS - edge
definition: Et beholderelement for metadata om kanten. NUDS - edge @no
modified: 2026-03-12

Description
type: Class
label: Beskrivning @sv
label: Beskrivelse @no
definition: Ett generiskt element avsett att innehålla en textbeskrivning. NUDS - description @sv
definition: A generic element intended to contain a textual description. NUDS - description
definition: Et generisk element ment å inneholde en tekstlig beskrivelse. NUDS - description @no
scope note: edgeDescriptionCollection
modified: 2026-03-12

External location (URL)
type: Class
label: Extern länk (URL) @sv
label: Ekstern adresse (URL) @no
definition: Elektronisk adress från vilken resursen är tillgänglig. BIBFRAME - electronicLocator @sv
definition: Electronic location from which the resource is available. BIBFRAME - electronicLocator
definition: Elektronisk adresse som ressursen er tilgjengelig fra. BIBFRAME - electronicLocator @no
modified: 2026-03-12

Era (BC)
type: Class
label: Era (f.Kr.) @sv
label: Æra (f.v.t.) @no
definition: Bestämmer den era som datumet inföll på. Anges om f.Kr. @sv
definition: Decides the era in which the date occured. Stated if B.C.
definition: Bestemmer epoken da datoen inntraff. Oppgitt om f.Kr. (f.v.t.) @no
scope note: eraCollection
modified: 2026-03-12

Family
type: Class
label: Släkt @sv
label: Slekt @no
definition: Släkter, familjer, dynastier och kungahus räknas som Släkt. BIBFRAME - Family @sv
definition: Families, dynasties and royal houses count as Family. BIBFRAME - Family
definition: Slekter, familier, dynastier og kongehus teller som Slekt. BIBFRAME - Family @no
scope note: familyNameCollection
modified: 2026-03-12

File
type: Class
label: Fil @sv
definition: Ger åtkomst till innehållsfilerna. METS - file @sv
definition: Provides access to the content files. METS - file
definition: Gir tilgang til innholdsfilene. METS - file @no
modified: 2026-03-12

File group
type: Class
label: Filgrupp @sv
label: Filgruppe @no
definition: Listar alla filer som utgör en enda elektronisk version av det digitala objektet. METS - filGrp @sv
definition: Lists all of the files which comprise a single electronic version of the digital library object. METS - fileGrp
definition: Viser alle filene som utgjør en enkelt elektronisk versjon av det digitale objektet. METS - filGrp @no
modified: 2026-03-12

Files
type: Class
label: Filer @sv
definition: Filsektionen innehåller ett eller flera fileGroup-element som används för att gruppera relaterade filer. METS - fileSec @sv
definition: The file section contains one or more fileGroup elements used to group together related files. METS - fileSec
definition: Fildelen inneholder ett eller flere fileGroup-elementer som brukes til å gruppere relaterte filer. METS - fileSec @no
modified: 2026-03-12

Form of work
type: Class
label: Verkets form @sv
definition: En klass eller genre som ett verk tillhör. Kan användas för att skilja ett verk från ett annat verk med samma titel. MARC21 - 380 @sv
definition: A class or genre to which a work belongs. May be used to differentiate a work from another work with the same title. MARC21 - 380
definition: En klasse eller sjanger som et verk tilhører. Kan brukes til å skille et verk fra et annet verk med samme tittel. MARC21 - 380 @no
scope note: formOfWorkCollection
modified: 2026-03-12

Gender
type: Class
label: Kön @sv
label: Kjønn @no
definition: Kön. MADS - gender @sv
definition: Gender. MADS - gender
definition: Kjønn. MADS - gender @no
scope note: genderCollection
modified: 2026-03-12

Genre/form
type: Class
label: Sjanger/form @no
definition: En eller flera termer som betecknar en kategori som kännetecknar en viss stil, form eller innehåll, såsom konstnärlig, musikalisk, litterär komposition etc. MODS - genre @sv
definition: A term or terms that designate a category characterizing a particular style, form, or content, such as artistic, musical, literary composition, etc. MODS - genre
definition: Et eller flere begreper som betegner en kategori som karakteriserer en bestemt stil, form eller innhold, for eksempel kunstnerisk, musikalsk, litterær komposisjon osv. MODS - genre @no
scope note: genreCollection
modified: 2026-03-12

Entity
type: Class
label: Enhet @sv
definition: Enhet som innehar objektet eller från vilket det är tillgängligt. BIBFRAME - heldBy @sv
definition: Entity holding the item or from which it is available. BIBFRAME - heldBy
definition: Enhet som holder objektet eller som det er tilgjengelig fra. BIBFRAME - heldBy @no
modified: 2026-03-12

Historical countries
type: Class
label: Historiska länder @sv
label: Historiske land @no
definition: Länder och riken som inte längre existerar som självständiga stater. @sv
definition: Countries and kingdoms that no longer exist as independent states.
definition: Land og riker som ikke lenger eksisterer som selvstendige stater. @no
scope note: historicalCountryCollection
modified: 2026-03-12

Identifier
type: Class
label: Identifikator @sv
definition: Ett unikt standardnummer eller kod som specifikt identifierar en resurs. MODS - identifier @sv
definition: A unique standard number or code that distinctively identifies a resource. MODS - identifier
definition: Et unikt standardnummer eller kode som spesifikt identifiserer en ressurs. MODS - identifier @no
modified: 2026-03-12

Type
type: Class
label: Typ @sv
definition: Identifierar typen av identifierare som registreras. MODS - identifier/@type @sv
definition: Identifies the type of identifier that is recorded. MODS - identifier/@type
definition: Identifiserer typen identifikator som er registrert. MODS - identifier/@type @no
scope note: identifierTypeCollection
modified: 2026-03-12

Media type (type)
type: Class
label: Mediatyp (typ) @sv
definition: Den elektroniska formattypen eller datarepresentationen för resursen. MODS - internetMediaType @sv
definition: The electronic format type, or the data representation, of the resource. MODS - internetMediaType
definition: Den elektroniske formattypen eller datarepresentasjonen til ressursen. MODS - internetMediaType @no
scope note: internetMediaTypeCollection
modified: 2026-03-12

Language
type: Class
label: Språk @sv
definition: Språk som är kopplat till en resurs eller dess delar. BIBFRAME - language @sv
definition: Language associated with a resource or its parts. BIBFRAME - language
definition: Språk knyttet til en ressurs eller dens deler. BIBFRAME - language @no
scope note: languageCollection
modified: 2026-03-12

Level
type: Class
label: Nivå @sv
definition: Den hierarkiska nivån för materialen som beskrivs av elementet. EAD - archdesc@level @sv
definition: The hierarchical level of the materials being described by the element. EAD - archdesc@level
definition: Det hierarkiske nivået til materialene som beskrives av elementet. EAD - archdesc@level @no
scope note: levelCollection
modified: 2026-03-12

Archival institution (alvin-location)
type: Class
label: Arkivinstitution (alvin-location) @sv
label: Arkivinstitusjon (alvin-location) @no
definition: Institutionen eller arkivet som innehar resursen, den fysiska platsen för resursen och/eller den elektroniska platsen för en digital resurs i form av en URL. MODS - location @sv
definition: The institution or repository holding the resource, the physical location of the resource, and/or the electronic location for a digital resource in the form of a URL. MODS - location
definition: Institusjonen eller depotet som har ressursen, den fysiske plasseringen av ressursen og/eller den elektroniske plasseringen for en digital ressurs i form av en URL. MODS - location @no
modified: 2026-03-12

Weight
type: Class
label: Vikt @sv
label: Vekt @no
definition: Ett ord eller en fras som hänvisar till någon kvantitet av ett föremål eller en vara, vanligtvis bestående av ett nummer, en enhet och ett namn. TEI - measure @sv
definition: A word or phrase referring to some quantity of an object or commodity, usually comprising a number, a unit, and a commodity name. TEI - measure
definition: Et ord eller en setning som refererer til en viss mengde av en gjenstand eller vare, vanligvis bestående av et tall, en enhet og et navn. TEI - measure @no
modified: 2026-03-12

Contents (manuscript)
type: Class
label: Innehåll (handskrift) @sv
label: Innhold (manuskript) @no
definition: Beskriver det intellektuella innehållet i ett manuskript, en manuskriptdel eller annat objekt antingen som en serie stycken eller som en serie strukturerade manuskriptdelar. TEI - msContents @sv
definition: Describes the intellectual content of a manuscript, manuscript part, or other object either as a series of paragraphs or as a series of structured manuscript items. TEI - msContents
definition: Beskriver det intellektuelle innholdet i et manuskript, en manuskriptdel eller et annet objekt enten som en serie avsnitt eller som en serie strukturerte manuskriptelementer. TEI - msContents @no
modified: 2026-03-12

Part
type: Class
label: Del @sv
definition: Beskriver ett enskilt verk eller föremål inom det intellektuella innehållet i ett manuskript, en del av ett manuskript eller annat föremål. TEI - msItem @sv
definition: Describes an individual work or item within the intellectual content of a manuscript, manuscript part, or other object. TEI - msItem
definition: Beskriver et individuelt verk eller element innenfor det intellektuelle innholdet i et manuskript, en del av et manuskript eller et annet objekt. TEI - msItem @no
modified: 2026-03-12

Music key
type: Class
label: Tonart @sv
label: Nøkkel @no
definition: Tonhöjd och modus för musik. BIBFRAME - musicKey @sv
definition: Pitch and mode for music. BIBFRAME - musicKey
definition: Tonehøyde og modus for musikk. BIBFRAME - musicKey @no
scope note: musicKeyCollection
modified: 2026-03-12

Medium of performance
type: Class
label: Besättning @sv
label: Besetning @no
definition: Instrumental, vokal och/eller annat framförandemedium för vilket en musikalisk resurs ursprungligen utformades, skrevs eller framfördes. BIBFRAME - musicMedium @sv
definition: Instrumental, vocal, and/or other medium of performance for which a musical resource was originally conceived, written or performed. BIBFRAME - musicMedium
definition: Instrumental, vokal og/eller annet fremføringsmedium som en musikalsk ressurs opprinnelig ble unnfanget, skrevet eller fremført for. BIBFRAME - musicMedium @no
scope note: musicMediumCollection
modified: 2026-03-12

Notation
type: Class
label: Notationssätt @sv
label: Notasjon @no
definition: Information om symbolsystemet som används för att förmedla innehållet i en musikresurs. BIBFRAME - MusicNotation @sv
definition: Information on the symbol system used to convey the content of a music resource. BIBFRAME - MusicNotation
definition: nformasjon om symbolsystemet som brukes til å formidle innholdet i en musikkressurs. BIBFRAME - MusicNotation @no
scope note: musicNotationCollection
modified: 2026-03-12

Name
type: Class
label: Namn @sv
label: Navn @no
definition: Används för person-, organisations- eller släktnamn. MADS - name @sv
definition: Used for personal, corporate or family names. MADS - name
definition: Brukes for personnavn, organisasjonsnavn eller familienavn. MADS - name @no
modified: 2026-03-12

Part of a name
type: Class
label: Del av ett namn @sv
label: Del av et navn @no
definition: De individuellt analyserade delarna som tillsammans utgör det fullständiga namnet. MADS - namePart @sv
definition: The individual parsed parts that together make up the full name. MADS - namePart
definition: De individuelle analyserte delene som til sammen utgjør det fulle navnet. MADS - namePart @no
modified: 2026-03-12

Nationality
type: Class
label: Nationalitet @sv
label: Nasjonalitet @no
definition: Ett land som en person är identifierad med. MADS - nationality @sv
definition: A country with which a person is identified. MADS - nationality
definition: Et land som en person er identifisert med. MADS - nationality @no
modified: 2026-03-12

Note
type: Class
label: Anmärkning @sv
definition: Information, vanligtvis i textform, om attribut för en resurs eller någon aspekt av en resurs. BIBFRAME - note @sv
definition: Information, usually in textual form, on attributes of a resource or some aspect of a resource. BIBFRAME - note
definition: Informasjon, vanligvis i tekstform, om attributter til en ressurs eller noen aspekter ved en ressurs. BIBFRAME - note @no
modified: 2026-03-12

Type of note
type: Class
label: Typ av anmärkning @sv
label: Type av note @no
definition: Typ av anmärkning. BIBFRAME - noteType @sv
definition: Type of note. BIBFRAME - noteType
definition: Type av note. BIBFRAME - noteType @no
scope note: noteTypeCollection
modified: 2026-03-12

Numeric designation
type: Class
label: Numerisk beteckning @sv
label: Numerisk betegnelse @no
definition: Ett serienummer, opusnummer eller tematiskt indexnummer som tilldelats ett musikverk av kompositören, förläggaren eller en musikforskare. Kan användas för att skilja ett musikaliskt verk från ett annat med samma titel. MARC21 - 383 @sv
definition: A serial number, opus number, or thematic index number assigned to a musical work by the composer, publisher, or a musicologist. May be used to differentiate a musical work from another with the same title. MARC21 - 383
definition: Tekst Et serienummer, opusnummer eller tematisk indeksnummer tildelt et musikkverk av komponisten, utgiveren eller en musikkforsker. Kan brukes til å skille et musikkverk fra et annet med samme tittel. MARC21 - 383 @no
modified: 2026-03-12

Obverse
type: Class
label: Åtsida @sv
label: Advers @no
definition: För kodning av typologiska attribut på åtsidan av ett mynt. NUDS - obverse @sv
definition: For encoding typological attributes about the obverse of a coin. NUDS - obverse
definition: For koding av typologiske attributter på forsiden av en mynt. NUDS - obverse @no
modified: 2026-03-12

Organisation (alvin-organisation)
type: Class
label: Organisasjon (alvin-organisation) @no
definition: En auktoritetspost som beskriver ett organisationsnamn. MADS - mads @sv
definition: An authority record that describes a corporate name. MADS - mads
definition: En autoritetspost som beskriver et organisasjonsnavn. MADS - mads @no
modified: 2026-03-12

Organisation information
type: Class
label: Organisationsinformation @sv
label: Organisasjonsinformasjon @no
definition: En behållare för organisationsnamn. Det inkluderar underelement som specifikt relaterar till organisationen som namnges av det elementet. - MADS - organizationInfo @sv
definition: A container element for organisation names. It includes subelements that relate specifically to the organisation named by that element. - MADS - organizationInfo
definition: En beholder for organisasjonsnavn. Det inkluderer underelementer som er spesifikt relatert til organisasjonen som er navngitt av det elementet. - MADS - organizationInfo @no
modified: 2026-03-12

Text direction
type: Class
label: Textriktning @sv
label: Tekstretning @no
definition: Anges när titeln eller namnet innehåller text som har en riktning från höger till vänster. MARC21 - Control Subfields @sv
definition: Set when the title or the name contains text that has a right-to-left orientation. MARC21 - Control Subfields
definition: Angis når tittelen eller navnet inneholder tekst som har retning fra høyre til venstre. MARC21 - Control Subfields @no
scope note: orientationCodeCollection
modified: 2026-03-12

Origin date
type: Class
label: Tillkomsttid @sv
label: Tilkomsttid @no
definition: Datum eller datumintervall kopplat till skapandet av ett verk. BIBFRAME - originDate @sv
definition: Date or date range associated with the creation of a work. BIBFRAME - originDate
definition: Dato eller datoperiode knyttet til opprettelsen av et verk. BIBFRAME - originDate @no
modified: 2026-03-12

Place of publication or production
type: Class
label: Utgivnings- eller tillverkningsplats @sv
label: Sted for utgivelse eller produksjon @no
definition: Plats där skapandet av resursen har sitt ursprung. BIBFRAME - originPlace @sv
definition: Place from which the creation of the resource originated. BIBFRAME - originPlace
definition: Stedet hvor ressursen ble opprettet. BIBFRAME - originPlace @no
modified: 2026-03-12

Part
type: Class
label: Del @sv
definition: Del av en resurs som informationen gäller. BIBFRAME - part @sv
definition: Part of a resource to which information applies. BIBFRAME - part
definition: Del av en ressurs som informasjonen gjelder. BIBFRAME - part @no
modified: 2026-03-12

Type
type: Class
label: Typ @sv
definition: Typ av del. MODS - @type @sv
definition: The type of part. MODS - @type
definition: Type av del. MODS - @type @no
scope note: partTypeCollection
modified: 2026-03-12

Person (alvin-person)
type: Class
definition: En auktoritetspost som beskriver ett personnamn. MADS - mads @sv
definition: An authority record that describes a personal name. MADS - mads
definition: En autoritetspost som beskriver et personnavn. MADS - mads @no
modified: 2026-03-12

Personal information
type: Class
label: Personinformation @sv
label: Personopplysninger @no
definition: En behållare för personnamn. Det inkluderar underelement som specifikt relaterar till personen som namnges av det elementet. - MADS - personInfo @sv
definition: A container element for person names. It includes subelements that relate specifically to the person named by that element. - MADS - personInfo
definition: En beholder for personnavn. Det inkluderer underelementer som er spesifikt relatert til personen som er navngitt av det elementet. - MADS - personInfo @no
modified: 2026-03-12

Other physical description
type: Class
label: Övrig fysisk beskrivning @sv
label: Annen fysisk beskrivelse @no
definition: En behållare för underelement som används för den fysiska beskrivningen av resursen. MODS - physicalDescription @sv
definition: A container element for subelements used for the physical description of the resource. MODS - physicalDescription
definition: En beholder for underelementer som brukes for den fysiske beskrivelsen av ressursen. MODS - physicalDescription @no
modified: 2026-03-12

Physical location
type: Class
label: Fysisk placering @sv
label: Fysisk plassering @no
definition: Identifierar organisationen som äger objektet eller från vilket det är tillgängligt. Kan också innehålla detaljerad information om hur man hittar föremålet i en samling. MARC21 - 852 @sv
definition: Identifies the organization holding the item or from which it is available. May also contain detailed information about how to locate the item in a collection. MARC21 - 852
definition: Identifiserer organisasjonen som eier objektet eller som det er tilgjengelig fra. Kan også inneholde detaljert informasjon om hvordan du finner gjenstanden i en samling. MARC21 - 852 @no
modified: 2026-03-12

Place (alvin-place)
type: Class
label: Plats (alvin-place) @sv
label: Sted (alvin-place) @no
definition: En auktoritetspost som beskriver ett geografiskt namn. MADS - mads @sv
definition: An authority record that describes a geographic name. MADS - mads
definition: En autoritetspost som beskriver et geografisk navn. MADS - mads @no
modified: 2026-03-12

Geographical point
type: Class
label: Geografisk punkt @sv
definition: En punkt som beskrivs med hjälp av ett koordinatsystem relativt till jorden. WGS84 @sv
definition: A point, described using a coordinate system relative to Earth. WGS84
definition: Et punkt, beskrevet ved hjelp av et koordinatsystem i forhold til Jorden. WGS84 @no
modified: 2026-03-12

Production method
type: Class
label: Produktionsmetod @sv
label: Produksjonsmetode @no
definition: Process som används för att producera en resurs. BIBFRAME - productionMethod @sv
definition: Process used to produce a resource. BIBFRAME - productionMethod
definition: Prosess som brukes til å produsere en ressurs. BIBFRAME - productionMethod @no
scope note: productionMethodCollection
modified: 2026-03-12

Record (alvin-record)
type: Class
label: Post (alvin-record) @sv
definition: Bibliografisk post i Alvin. MARCXML - record @sv
definition: Bibliographic record in Alvin. MARCXML - record
modified: 2026-03-12

Record information
type: Class
label: Postinformation @sv
label: Postinformasjon @no
definition: En behållare som innehåller underelement relaterade till information som är nödvändig för att hantera metadata. MODS - recordInfo @sv
definition: A container element that includes subelements relating to information necessary for managing metadata. MODS - recordInfo
definition: En beholder som inkluderer underelementer relatert til informasjon som er nødvendig for å administrere metadata. MODS - recordInfo @no
modified: 2026-03-12

Related
type: Class
label: Relaterad @sv
label: Relatert @no
definition: Inkluderar ett namn eller en term som har en relation till den auktoriserade formen. MADS - related @sv
definition: Includes a name or term that has some relation to the authoritative form. MADS - related
definition: Inkluderer et navn eller en term som har en relasjon til den autoriserte formen. MADS - related @no
modified: 2026-03-12

Related record in Alvin
type: Class
label: Relaterad post i Alvin @sv
label: Relatert post i Alvin @no
definition: Varje relation med andra poster i Alvin. BIBFRAME - relatedTo @sv
definition: Any relationship with other records in Alvin. BIBFRAME - relatedTo
definition: Ethvert forhold til andre poster i Alvin . BIBFRAME - relatedTo @no
modified: 2026-03-12

Type of relation
type: Class
label: Typ av relation @sv
label: Type relasjon @no
definition: Relationen mellan den relaterade resursen och den resurs som beskrivs. MODS - relatedItem/@type @sv
definition: The relationship between the related resource and the resource being described. MODS - relatedItem/@type
definition: Forholdet mellom den relaterte ressursen og ressursen som beskrives. MODS - relatedItem/@type @no
scope note: relatedToTypeCollection
modified: 2026-03-12

Reverse
type: Class
label: Frånsida @sv
label: Revers @no
definition: För kodning av typologiska attribut på frånsidan av ett mynt. NUDS - reverse @sv
definition: For encoding typological attributes about the reverse of a coin. NUDS - reverse
definition: For koding av typologiske attributter om baksiden av en mynt. NUDS - reverse @no
modified: 2026-03-12

Rights
type: Class
label: Rättigheter @sv
label: Rettigheter @no
definition: Information om rättigheter knutna till resursen. DC - rights @sv
definition: Information about rights held in and over the resource. DC - rights
definition: Informasjon om rettigheter knyttet til ressursen. DC - rights @no
scope note: rightsCollection
modified: 2026-03-12

Role
type: Class
label: Roll @sv
label: Rolle @no
definition: Funktion tillhandahållen av en bidragsgivare, t.ex. författare, illustratör, etc. BIBFRAME - role @sv
definition: Function provided by a contributor, e.g., author, illustrator, etc. BIBFRAME - role
definition: Funksjon levert av en bidragsyter, f.eks. forfatter, illustratør osv. BIBFRAME - role @no
scope note: roleCollection
modified: 2026-03-12

Area
type: Class
label: Yta @sv
label: Areal @no
definition: Om mätningen omfattar mer än en yta, specificeras denna mätning. TEI – dimensions/@scope @sv
definition: Where the measurement summarizes more than one observation, specifies the applicability of this measurement. TEI – dimensions/@scope
definition: Hvis målingen dekker mer enn én overflate, er denne målingen spesifisert. TEI – dimensions/@scope @no
scope note: scopeCollection
modified: 2026-03-12

Collection
type: Class
label: Samling @sv
definition: Specifik avdelning, bibliotek etc. inom den ägarorganisationen där föremålet finns eller från vilket det är tillgängligt. Namnet anges i kodad form. MARC21 - 852b @sv
definition: Specific department, library, etc., within the holding organization in which the item is located or from which it is available. Name is given in coded form. MARC21 - 852b
definition: Spesifikk avdeling, bibliotek etc. innenfor eierorganisasjonen hvor gjenstanden befinner seg eller er tilgjengelig fra. Navnet legges inn i kodet form. MARC21 - 852b @no
scope note: subcollectionCollection
modified: 2026-03-12

Subject
type: Class
label: Ämnesord @sv
label: Emneord @no
definition: Ämnesord som beskriver en resurs. BIBFRAME - subject. @sv
definition: Subject term(s) describing a resource. BIBFRAME - subject.
definition: Emneord som beskriver en ressurs. BIBFRAME - subject. @no
modified: 2026-03-12

Description/summary
type: Class
label: Beskrivning/sammanfattning @sv
label: Beskrivelse/sammendrag @no
definition: Sammanfattning eller kort beskrivning av den beskrivna resursen. BIBFRAME - summary @sv
definition: Summary or abstract of the resource described. BIBFRAME - summary
definition: Sammendrag eller kort beskrivelse av ressursen som er beskrevet. BIBFRAME - summary @no
modified: 2026-03-12

Title
type: Class
label: Titel @sv
label: Tittel @no
definition: Namnet på en resurs. BIBFRAME - title @sv
definition: Name given to a resource. BIBFRAME - title
definition: Navn gitt til en ressurs. BIBFRAME - title @no
modified: 2026-03-12

Type
type: Class
label: Typ @sv
definition: Typ av namn. MODS - @type @sv
definition: The type of name. MODS - @type
definition: Navnetype. MODS - @type @no
scope note: typeCollection
modified: 2026-03-12

Resource type
type: Class
label: Resurstyp @sv
label: Ressurstype @no
definition: En term som specificerar egenskaperna och den allmänna typen av innehåll för resursen. MODS - typeOfResource @sv
definition: A term that specifies the characteristics and general type of content of the resource. MODS - typeOfResource
definition: Et begrep som spesifiserer egenskapene og den generelle typen innhold til ressursen. MODS - typeOfResource @no
scope note: typeOfResourceCollection
modified: 2026-03-12

Unit of measurement
type: Class
label: Måttenhet @sv
label: Måleenhet @no
definition: Namnger enheten som används för mätningen. TEI – dimensions/@unit @sv
definition: Names the unit used for the measurement. TEI – dimensions/@unit
definition: Navngir enheten som brukes for målingen. TEI – dimensions/@unit @no
scope note: unitCollection
modified: 2026-03-12

Variant
type: Class
definition: En hänvisning till ett namn som inte anses vara den auktoriserade formen. MADS - variant @sv
definition: A reference to a name that is not considered the authorised form. MADS - variant
definition: En referanse til et navn som ikke anses som den autoriserte formen. MADS - variant @no
modified: 2026-03-12

Variant title
type: Class
label: Varianttitel @sv
label: Varianttittel @no
definition: Titel kopplad till resursen som skiljer sig från titeln. BIBFRAME - VariantTitle @sv
definition: Title associated with the resource that is different from the title. BIBFRAME - VariantTitle
definition: Tittel knyttet til ressursen som er forskjellig fra tittelen. BIBFRAME - VariantTitle @no
modified: 2026-03-12

Type of variation
type: Class
label: Typ av variant @sv
label: Type variant @no
definition: Typ av variant. BIBFRAME - variantType @sv
definition: Type of variation. BIBFRAME - variantType
definition: Type variant. BIBFRAME - variantType @no
scope note: variantTypeCollection
modified: 2026-03-12

Work (alvin-work)
type: Class
label: Verk (alvin-work) @sv
definition: Resurs som återspeglar det konceptuella innehållet i en post. BIBFRAME - Work @sv
definition: Resource reflecting a conceptual essence of a cataloging resource. BIBFRAME - Work
definition: Ressurs som gjenspeiler det konseptuelle innholdet i en post. BIBFRAME - Work @no
modified: 2026-03-12

Terms of use and access
type: DatatypeProperty
domain: Class
  union of: Record (alvin-record)
  union of: Component
range: Literal
label: Villkor för användning och åtkomst @sv
label: Vilkår for bruk og tilgang @no
definition: Åtkomstbegränsningar och tillstånd avseende tillgång till en resurs, t.ex. utlåningspolicy, åtkomstbegränsningar, embargon. BIBFRAME - AccessPolicy @sv
definition: Access restrictions and allowances regarding access to a resource, e.g., lending policy, access restrictions, embargos. BIBFRAME - AccessPolicy
definition: Tilgangsbegrensninger og tillatelser angående tilgang til en ressurs, for eksempel utlånspolitikk, tilgangsbegrensninger, embargoer. BIBFRAME - AccessPolicy @no
example: Description information
modified: 2026-03-12

Accruals
type: DatatypeProperty
domain: Record (alvin-record)
range: Literal
label: Tillväxt @sv
label: Tilvekst @no
definition: Ett element för information om förväntade tillägg till de material som beskrivs. EAD - accruals @sv
definition: An element for information about anticipated additions to the materials being described. EAD - accruals
definition: Et element for informasjon om forventede tillegg til materialene som beskrives. EAD - accruals @no
example: Description information
modified: 2026-03-12

Address
type: ObjectProperty
domain: Class
  union of: Organisation (alvin-organisation)
  union of: Archival institution (alvin-location)
range: Address
label: Adress @sv
label: Adresse @no
definition: Adress. MADS - address @sv
definition: Address. MADS - address
definition: Adresse. MADS - address @no
example: Authority information
modified: 2026-03-12

Administrative metadata
type: ObjectProperty
domain: Record (alvin-record)
range: Administrative metadata
label: Administrativ metadata @sv
definition: Metadata om metadata. BIBFRAME - adminMetadata @sv
definition: Metadata about the metadata. BIBFRAME - adminMetadata
definition: Metadata om metadataene. BIBFRAME - adminMetadata @no
example: Administrative information
modified: 2026-03-12

Agent
type: ObjectProperty
domain: Class
  union of: Record (alvin-record)
  union of: Work (alvin-work)
  union of: Part
  union of: Component
range: Agent
definition: Enhet som har en roll i en resurs, till exempel en person eller organisation. BIBFRAME - Agent @sv
definition: Entity having a role in a resource, such as a person or organisation. BIBFRAME - Agent
definition: Enhet som har en rolle i en ressurs, for eksempel en person eller organisasjon. BIBFRAME - Agent @no
example: Agent information
modified: 2026-03-12

Technique
type: ObjectProperty
domain: Record (alvin-record)
range: Technique
label: Teknik @sv
label: Teknikk @no
definition: Fysiskt eller kemiskt ämne applicerat på ett basmaterial av en resurs. BIBFRAME - AppliedMaterial @sv
definition: Physical or chemical substance applied to a base material of a resource. BIBFRAME - AppliedMaterial
definition: Fysisk eller kjemisk stoff påført et grunnmateriale av en ressurs. BIBFRAME - AppliedMaterial @no
example: Carrier information
modified: 2026-03-12

Value
type: ObjectProperty
domain: Record (alvin-record)
range: Value
label: Valör @sv
label: Verdi @no
definition: Valören för objektet. NUDS - appraisal @sv
definition: The appraisal of the object. NUDS - appraisal
definition: Vurdering av objektet. NUDS - appraisal @no
example: Description information
modified: 2026-03-12

Arrangement
type: DatatypeProperty
domain: Record (alvin-record)
range: Literal
label: Struktur @sv
label: Ordning @no
definition: Ett element för att beskriva organisationen eller arkiveringsföljden för handlingarna. EAD - arrangement @sv
definition: An element for describing the organisation or filing sequence of the records. EAD - arrangement
definition: Et element for å beskrive organiseringen eller arkiveringssekvensen til dokumentene. EAD - arrangement @no
example: Description information
modified: 2026-03-12

Authority
type: ObjectProperty
domain: Class
  union of: Person (alvin-person)
  union of: Organisation (alvin-organisation)
  union of: Place (alvin-place)
  union of: Archival institution (alvin-location)
range: Authority
label: Auktoritet @sv
label: Autoritet @no
definition: En behållare som innehåller en standardiserad auktoriserad form av namn. MADS - authority @sv
definition: A container that includes a standardised authoritative form. MADS - authority
definition: En beholder som inkluderer en standardisert autorisert form for navn. MADS - authority @no
example: Authority information
modified: 2026-03-12

Axis
type: ObjectProperty
domain: Record (alvin-record)
range: Axis
label: Stampställning @sv
label: Stampstilling @no
definition: Orienteringen av åtsidan till frånsidan. NUDS - axis @sv
definition: The orientation of the obverse to the reverse. NUDS - axis
definition: Orienteringen av forsiden til baksiden. NUDS - axis @no
example: Description information
modified: 2026-03-12

Material
type: ObjectProperty
domain: Record (alvin-record)
range: Material
label: Materiale @no
definition: Underliggande fysiskt material för en resurs. BIBFRAME - BaseMaterial @sv
definition: Underlying physical material of a resource. BIBFRAME - BaseMaterial
definition: Underliggende fysisk materiale til en ressurs. BIBFRAME - BaseMaterial @no
example: Carrier information
modified: 2026-03-12

Binding
type: DatatypeProperty
domain: Book binding
range: Literal
label: Band @sv
label: Bind @no
definition: Innehåller en beskrivning av ett bokband, det vill säga typ av omslag, kartong etc. applicerat på ett manuskript eller annat föremål. TEI - binding @sv
definition: Contains a description of one binding, i.e. type of covering, boards, etc. applied to a manuscript or other object. TEI - binding
definition: Inneholder en beskrivelse av et bind, det vil si typen omslag, kartong osv. som er påført et manuskript eller annen gjenstand. TEI - binding @no
example: Description information
modified: 2026-03-12

Book binding
type: ObjectProperty
domain: Record (alvin-record)
range: Book binding
label: Bokband @sv
label: Bokbind @no
definition: Beskriver nuvarande och tidigare bindningar av ett manuskript eller annat föremål. TEI - bindingDesc @sv
definition: Describes the present and former bindings of a manuscript or other object. TEI - bindingDesc
definition: Beskriver nåværende og tidligere bindinger av et manuskript eller annen gjenstand. TEI - bindingDesc @no
example: Description information
modified: 2026-03-12

Date of birth
type: ObjectProperty
domain: Personal information
range: Date
label: Födelsedatum @sv
label: Fødselsdato @no
definition: Ett datum då en person föddes. MADS - birthDate @sv
definition: A date a person was born. MADS - birthDate
definition: En dato en person ble født. MADS - birthDate @no
example: Authority information
modified: 2026-03-12

Place of birth
type: ObjectProperty
domain: Personal information
range: Place of birth
label: Födelseort @sv
label: Fødested @no
definition: En stad eller ort där en person föddes. MADS - birthPlace @sv
definition: A city or place in which a person was born. MADS - birthPlace
definition: En by eller et sted hvor en person ble født. MADS - birthPlace @no
example: Authority information
modified: 2026-03-12

Cartographic data
type: ObjectProperty
domain: Record (alvin-record)
range: Cartographic data
label: Kartografiska data @sv
label: Kartografiske data @no
definition: Kartografiska data som identifierar egenskaper hos resursen, såsom koordinater, projektion, etc. BIBFRAME - cartographicAttributes @sv
definition: Cartographic data that identifies characteristics of the resource, such as coordinates, projection, etc. BIBFRAME - cartographicAttributes
definition: Kartografiske data som identifiserer egenskapene til ressursen, som koordinater, projeksjon osv. BIBFRAME - cartographicAttributes @no
example: Description information
modified: 2026-03-12

Uncertain information
type: ObjectProperty
domain: Class
  union of: Agent
  union of: Place of publication or production
  union of: Place of birth
  union of: Place of death
range: Uncertain information
label: Osäker uppgift @sv
label: Usikker informasjon @no
definition: Indikerar graden av säkerhet förknippad med någon aspekt av texten. TEI - certainty @sv
definition: Indicates the degree of certainty associated with some aspect of the text. TEI - certainty
definition: Angir graden av sikkerhet knyttet til enkelte aspekter av teksten. TEI - certainty @no
example: General property
modified: 2026-03-12

Checksum
type: ObjectProperty
domain: File
range: Checksum
label: Kontrollsumma @sv
label: Sjekksum @no
definition: Tillhandahåller ett värde för kontrollsumma för den associerade filen. METS - @CHECKSUM @sv
definition: Provides a checksum value for the associated file. METS - @CHECKSUM
definition: Gir en sjekksumverdi for den tilknyttede filen. METS - @CHECKSUM @no
example: File information
modified: 2026-03-12

Checksum type
type: DatatypeProperty
domain: Checksum
range: Literal
label: Typ av kontrollsumma @sv
label: Sjekksum type @no
definition: Anger den kontrollsumme-algoritm som används för att producera värdet i kontrollsumman. METS - @CHECKSUMTYPE @sv
definition: Specifies the checksum algorithm used to produce the value contained in the checksum. METS - @CHECKSUMTYPE
definition: Angir sjekksumalgoritmen som brukes til å produsere verdien i sjekksummen. METS - @CHECKSUMTYPE @no
example: File information
modified: 2026-03-12

Classification
type: ObjectProperty
domain: Record (alvin-record)
range: Classification
label: Klassifikation @sv
label: Klassifisering @no
definition: Klassificeringsnummer i valfritt schema. BIBFRAME - classification @sv
definition: Classification number in any scheme. BIBFRAME - classification
definition: Klassifikasjonsnummer i ethvert skjema. BIBFRAME - classification @no
example: Subject term, category and classification information
modified: 2026-03-12

Clock
type: ObjectProperty
domain: Axis
range: Clock
label: Klocka @sv
label: Klokke @no
definition: Klockställning. NUDS - axis/@clock @sv
definition: Clock designation. NUDS - axis/@clock
definition: Klokkestilling. NUDS - axis/@clock @no
example: Description information
modified: 2026-03-12

Collection
type: ObjectProperty
domain: Record (alvin-record)
range: Collection
label: Samling @sv
definition: En sammansatt grupp av föremål som inte ursprungligen publicerades, distribuerades eller producerades tillsammans. MODS - typeOfResource/@collection @sv
definition: A made-up multipart group of items that were not originally published, distributed, or produced together. MODS - typeOfResource/@collection
definition: En sammensatt gruppe av gjenstander som ikke opprinnelig ble publisert, distribuert eller produsert sammen. MODS - typeOfResource/@collection @no
example: General property
modified: 2026-03-12

Component
type: ObjectProperty
domain: Class
  union of: Subordinate components
  union of: Component
range: Component
label: Komponent @sv
definition: Ett element som betecknar en underordnad del av materialet som beskrivs. EAD - c @sv
definition: An element that designates a subordinate part of the materials being described. EAD - c
definition: Et element som betegner en underordnet del av materialet som beskrives. EAD - c @no
example: General property
modified: 2026-03-12

Conservation state
type: ObjectProperty
domain: Record (alvin-record)
range: Conservation state
label: Kondition @sv
label: Konservasjonstilstand @no
definition: De fysiska tillstånden för bevarande av ett föremål. NUDS - conservationState @sv
definition: The physical states of conservation of an object. NUDS - conservationState
definition: De fysiske tilstandene for bevaring av et objekt. NUDS - conservationState @no
example: Description information
modified: 2026-03-12

Coordinates
type: DatatypeProperty
domain: Cartographic data
range: Literal
label: Koordinater @sv
definition: Matematiskt system för att identifiera det område som täcks av det kartografiska innehållet i en resurs, uttryckt antingen med hjälp av longitud och latitud på planeternas yta eller med vinklarna för rätt uppstigning och deklination för himmelskt kartografiskt innehåll. BIBFRAME - coordinates @sv
definition: Mathematical system for identifying the area covered by the cartographic content of a resource, expressed either by means of longitude and latitude on the surface of planets or by the angles of right ascension and declination for celestial cartographic content. BIBFRAME - coordinates
definition: Matematisk system for å identifisere området som dekkes av det kartografiske innholdet til en ressurs, uttrykt enten ved hjelp av lengde- og breddegrad på overflaten av planeter eller ved vinklene for rett oppstigning og deklinasjon for himmelsk kartografisk innhold. BIBFRAME - coordinates @no
example: Description information
modified: 2026-03-12

Countermark
type: DatatypeProperty
domain: Record (alvin-record)
range: Literal
label: Kontramarkering @sv
label: Kontramerke @no
definition: En fysisk egenskap, skild från typologisk beskrivning. NUDS - countermark @sv
definition: A physical characteristic, separated from typological description. NUDS - countermark
definition: En fysisk karakteristikk, atskilt fra typologisk beskrivelse. @no
example: Description information
modified: 2026-03-12

Country
type: ObjectProperty
domain: Class
  union of: Place of publication or production
  union of: Place (alvin-place)
  union of: Address
  union of: Nationality
range: Country
label: Land @sv
definition: Landkod. MARC21 - 008/15-17 @sv
definition: Country code. MARC21 - 008/15-17
definition: Landekod. MARC21 - 008/15-17 @no
example: General property
modified: 2026-03-12

Currency
type: DatatypeProperty
domain: Value
range: Literal
label: Valuta @sv
definition: Valutan för ett värde. NUDS – value/@currency @sv
definition: The currency of a value. NUDS – value/@currency
definition: Valutaen til en verdi. NUDS – value/@currency @no
example: Description information
modified: 2026-03-12

Other years/dates
type: ObjectProperty
domain: Class
  union of: Record (alvin-record)
  union of: Work (alvin-work)
range: Other years/dates
label: Övriga år/datum @sv
label: Andre år/datoer @no
definition: Ett datum som inte tillhör någon annan kategori men som är viktigt att registrera. MODS - dateOther @sv
definition: A date that does not fall into another category but is important to record. MODS - dateOther
definition: En dato som ikke faller inn i en annen kategori, men som er viktig å registrere. MODS - dateOther @no
example: Origin information
modified: 2026-03-12

Type
type: ObjectProperty
domain: Other years/dates
range: Type
label: Typ @sv
definition: Attribut för att ange en specifik typ av datum som inte ansågs ha tillräcklig allmän användning för att ha ett eget datumelement. MODS - @type @sv
definition: Attribute to designate a specific kind of date which was not deemed of sufficient general use to have its own date element. MODS - @type
definition: Attributt for å angi en bestemt type dato som ikke ble ansett for tilstrekkelig generell bruk til å ha sitt eget datoelement. MODS - @type @no
example: Origin information
modified: 2026-03-12

Day
type: DatatypeProperty
domain: Date
range: Literal
label: Dag @sv
definition: Dag. Dateformat - DD @sv
definition: Day. Dateformat - DD
example: Origin information
modified: 2026-03-12

Date of death
type: ObjectProperty
domain: Personal information
range: Date
label: Dödsdatum @sv
label: Dødsdato @no
definition: Ett datum då en person dog. MADS - deathDate @sv
definition: A date a person died. MADS - deathDate
definition: En dato en person døde. MADS - deathDate @no
example: Authority information
modified: 2026-03-12

Place of death
type: ObjectProperty
domain: Personal information
range: Place of death
label: Dödsort @sv
label: Dødssted @no
definition: En stad eller ort där en person dog. MADS - deathPlace @sv
definition: A city or place where a person died. MADS - deathPlace
definition: En by eller sted der en person døde. MADS - deathPlace @no
example: Authority information
modified: 2026-03-12

Decoration
type: DatatypeProperty
domain: Class
  union of: Record (alvin-record)
  union of: Book binding
range: Literal
label: Dekor @sv
label: Dekorasjon @no
definition: Innehåller en anmärkning som beskriver antingen en dekorativ komponent eller en ganska homogen klass av sådana komponenter. TEI - decoNote @sv
definition: Contains a note describing either a decorative component, or a fairly homogenous class of such components. TEI - decoNote
definition: Inneholder en note som beskriver enten en dekorativ komponent, eller en ganske homogen klasse av slike komponenter. TEI - decoNote @no
example: Description information
modified: 2026-03-12

Depth/thickness
type: DatatypeProperty
domain: Measure
range: Literal
label: Djup/tjocklek @sv
label: Dybde/tykkelse @no
definition: Ett mått från framsidan till baksidan av ett föremål, vinkelrätt mot måttet som ges av breddelementet. TEI - depth @sv
definition: A measurement from the front to the back of an object, perpendicular to the measurement given by the width element. TEI - depth
definition: Et mål fra forsiden til baksiden av et objekt, vinkelrett på målingen gitt av breddeelementet. TEI - depth @no
example: Carrier information
modified: 2026-03-12

Description
type: DatatypeProperty
domain: Class
  union of: Obverse
  union of: Reverse
range: Literal
label: Beskrivning @sv
label: Beskrivelse @no
definition: En beskrivning är en detaljerad redogörelse som förklarar egenskaperna, funktionerna eller attributen hos något. Det syftar till att ge en tydlig förståelse genom ett levande och exakt språk. @sv
definition: A description is a detailed account that explains the characteristics, features, or attributes of something. It aims to provide a clear understanding through vivid and precise language.
definition: En beskrivelse er en detaljert beretning som forklarer egenskapene, funksjonene eller attributen til noe. Den har som mål å gi en klar forståelse gjennom et levende og presist språk. @no
example: Description information
modified: 2026-03-12

Description language
type: ObjectProperty
domain: Administrative metadata
range: Description language
label: Beskrivningsspråk @sv
label: Beskrivelsesspråk @no
definition: Språk som används för metadata. BIBFRAME - descriptionLanguage @sv
definition: Language used for the metadata. BIBFRAME - descriptionLanguage
definition: Språk som brukes for metadataene. BIBFRAME - descriptionLanguage @no
example: Language information
modified: 2026-03-12

Subordinate components
type: ObjectProperty
domain: Record (alvin-record)
range: Subordinate components
label: Underordnade komponenter @sv
label: Underordnede komponenter @no
definition: Ett containerelement som samlar information om de hierarkiska grupperingarna av materialet som beskrivs. EAD - dsc @sv
definition: A wrapper element that bundles information about the hierarchical groupings of the materials being described. EAD - dsc
definition: Et beholderelement som samler informasjon om de hierarkiske grupperingene til materialet som beskrives. EAD - dsc @no
example: General property
modified: 2026-03-12

Member type
type: ObjectProperty
domain: Organisation information
range: Member type
label: Medlemstyp @sv
label: Medlemstype @no
definition: Beskrivning. MADS - descriptor @sv
definition: Descriptor. MADS - descriptor
definition: Beskrivelse. MADS - descriptor @no
example: Authority information
modified: 2026-03-12

Diameter
type: DatatypeProperty
domain: Measure
range: Literal
definition: Diameter på ett runt föremål. NUDS - diameter @sv
definition: Diameter of a round object. NUDS - diameter
definition: Diameter på en rund gjenstand. NUDS - diameter @no
example: Carrier information
modified: 2026-03-12

Digital origin
type: ObjectProperty
domain: Files
range: Digital origin
label: Digitalt ursprung @sv
label: Digitalt opphav @no
definition: Metoden genom vilken resursen fick digital form. MODS - PhysicalDescription/ digitalOrigin @sv
definition: The method by which the resource achieved digital form. MODS - physicalDescription/ digitalOrigin
definition: Metoden som ressursen fikk digital form på. MODS - physicalDescription/ digitalOrigin @no
example: File information
modified: 2026-03-12

Measure
type: ObjectProperty
domain: Record (alvin-record)
range: Measure
label: Mått @sv
label: Mål @no
definition: Mått på bäraren eller bärarna och/eller behållaren för en resurs. BIBFRAME - dimensions @sv
definition: Measurements of the carrier or carriers and/or the container of a resource. BIBFRAME - dimensions
definition: Dimensjoner på bæreren eller bærerne og/eller beholderen til en ressurs. BIBFRAME - dimensions @no
example: Carrier information
modified: 2026-03-12

Year/date displayed
type: DatatypeProperty
domain: Class
  union of: Origin date
  union of: Organisation information
  union of: Personal information
range: Literal
label: År/datum som visas @sv
label: År/dato vises @no
definition: Fritextdatumfält som tillåter att ett datum representeras i läsbar form för att visa ett datum som det visas på resursen eller för att lägga till ytterligare sammanhang. MODS - displayDate @sv
definition: Free text date field that allows a date to be represented in human-readable form in order to display a date as it appears on the resource or to add additional context. MODS - displayDate
definition: Fritekstdatofelt som lar en dato representeres i lesbar form for å vise en dato slik den vises på ressursen eller for å legge til ekstra kontekst. MODS - displayDate @no
example: Origin information
modified: 2026-03-12

Display label
type: DatatypeProperty
domain: External location (URL)
range: Literal
label: Länktext @sv
label: Linktekst @no
definition: Text, endast för visningsändamål. MODS - url/@displayLabel @sv
definition: Text, for display purposes only. MODS - url/@displayLabel
definition: Tekst, kun for visningsformål. MODS - url/@displayLabel @no
example: Related information
modified: 2026-03-12

Edge description
type: ObjectProperty
domain: Record (alvin-record)
range: Edge description
label: Randtyp @sv
label: Randbeskrivelse @no
definition: Ett containerelement för metadata om kanten. NUDS - edge @sv
definition: A container element for metadata about the edge. NUDS - edge
definition: Et beholderelement for metadata om kanten. NUDS - edge @no
example: Description information
modified: 2026-03-12

Description
type: ObjectProperty
domain: Edge description
range: Description
label: Beskrivning @sv
label: Beskrivelse @no
definition: Ett generiskt element avsett att innehålla en textbeskrivning. NUDS - description @sv
definition: A generic element intended to contain a textual description. NUDS - description
definition: Et generisk element ment å inneholde en tekstlig beskrivelse. NUDS - description @no
example: Description information
modified: 2026-03-12

Edition
type: DatatypeProperty
domain: Record (alvin-record)
range: Literal
label: Utgåva/upplaga @sv
label: Utgave @no
definition: Information som identifierar utgåvan eller versionen av resursen och tillhörande ansvarsförklaringar för utgåvan; vanligtvis transkriberat. BIBFRAME - editionStatement @sv
definition: Information identifying the edition or version of the resource and associated statements of responsibility for the edition; usually transcribed. BIBFRAME - editionStatement
definition: Informasjon som identifiserer utgaven eller versjonen av ressursen og tilhørende ansvarserklæringer for utgaven; vanligvis transkribert. BIBFRAME - editionStatement @no
example: Description information
modified: 2026-03-12

External location (URL)
type: ObjectProperty
domain: Class
  union of: Record (alvin-record)
  union of: Organisation (alvin-organisation)
  union of: Person (alvin-person)
  union of: Archival institution (alvin-location)
  union of: Component
range: External location (URL)
label: Extern länk (URL) @sv
label: Ekstern adresse (URL) @no
definition: Elektronisk adress från vilken resursen är tillgänglig. BIBFRAME - electronicLocator @sv
definition: Electronic location from which the resource is available. BIBFRAME - electronicLocator
definition: Elektronisk adresse som ressursen er tilgjengelig fra. BIBFRAME - electronicLocator @no
example: Related information
modified: 2026-03-12

Email
type: DatatypeProperty
domain: Archival institution (alvin-location)
range: Literal
label: E-post @sv
definition: E-postadress. MADS - email @sv
definition: Email address. MADS - email
definition: E-postadresse. MADS - email @no
example: Authority information
modified: 2026-03-12

End date
type: ObjectProperty
domain: Class
  union of: Origin date
  union of: Other years/dates
  union of: Organisation information
range: Date
label: Slutdatum @sv
label: Slutdato @no
definition: Slutdatum för en händelse. Sammanhanget definieras på en högre nivå. MADS - endDate @sv
definition: End date for an event. The context is defined at a higher level. MADS - endDate
definition: Sluttdato for en hendelse. Konteksten er definert på et høyere nivå. MADS - endDate @no
example: Origin information
modified: 2026-03-12

Era (BC)
type: ObjectProperty
domain: Date
range: Era (BC)
label: Era (f.Kr.) @sv
label: Æra (f.v.t.) @no
definition: Bestämmer den era som datumet inföll på. Anges om f.Kr. @sv
definition: Decides the era in which the date occured. Stated if B.C.
definition: Bestemmer epoken da datoen inntraff. Oppgitt om f.Kr. (f.v.t.) @no
example: Origin information
modified: 2026-03-12

Explicit
type: DatatypeProperty
domain: Class
  union of: Record (alvin-record)
  union of: Part
range: Literal
label: Explicit (avslutande ord) @sv
label: Explicit (avsluttende ord) @no
definition: Innehåller de avslutande orden i själva texten, exklusive någon rubrik eller kolofon som kan följa den. TEI - explicit @sv
definition: Contains the explicit of a item, that is, the closing words of the text proper, exclusive of any rubric or colophon which might follow it. TEI - explicit
definition: Inneholder de avsluttende ordene i selve teksten, unntatt enhver rubrikk eller kolofon som kan følge den. TEI - explicit @no
example: Description information
modified: 2026-03-12

Extent
type: DatatypeProperty
domain: Class
  union of: Record (alvin-record)
  union of: Component
range: Literal
label: Omfång @sv
label: Omfang @no
definition: Antal och typ av enheter och/eller underenheter som utgör en resurs. BIBFRAME - extent @sv
definition: Number and type of units and/or subunits making up a resource. BIBFRAME - extent
definition: Antall og type enheter og/eller underenheter som utgjør en ressurs. BIBFRAME - extent @no
example: Carrier information
modified: 2026-03-12

Family
type: ObjectProperty
domain: Name
range: Family
label: Släkt @sv
label: Slekt @no
definition: Släkter, familjer, dynastier och kungahus räknas som Släkt. BIBFRAME - Family @sv
definition: Families, dynasties and royal houses count as Family. BIBFRAME - Family
definition: Slekter, familier, dynastier og kongehus teller som Slekt. BIBFRAME - Family @no
example: Authority information
modified: 2026-03-12

Field of activity
type: DatatypeProperty
domain: Person (alvin-person)
range: Literal
label: Verksamhetsområde @sv
label: Aktivitetsfelt @no
definition: Expertis eller kompetensområde för en person. MADS - fieldOfEndeavor @sv
definition: Expertise, or area of competence of a person. MADS - fieldOfEndeavor
definition: Ekspertise eller kompetanseområde til en person. MADS - fieldOfEndeavor @no
example: Authority information
modified: 2026-03-12

File
type: ObjectProperty
domain: File group
range: File
label: Fil @sv
definition: Ger åtkomst till innehållsfilerna. METS - file @sv
definition: Provides access to the content files. METS - file
definition: Gir tilgang til innholdsfilene. METS - file @no
example: File information
modified: 2026-03-12

File group
type: ObjectProperty
domain: Files
range: File group
label: Filgrupp @sv
label: Filgruppe @no
definition: Listar alla filer som utgör en enda elektronisk version av det digitala objektet. METS - filGrp @sv
definition: Lists all of the files which comprise a single electronic version of the digital library object. METS - fileGrp
definition: Viser alle filene som utgjør en enkelt elektronisk versjon av det digitale objektet. METS - filGrp @no
example: File information
modified: 2026-03-12

Link to the file
type: DatatypeProperty
domain: File
range: Literal
label: Länk till filen @sv
label: Link til filen @no
definition: Ger en pekare till platsen för en digital innehållsfil. METS - FLocat @sv
definition: Provides a pointer to the location of a content file. METS - FLocat
definition: Gir en peker til plasseringen av en digital innholdsfil. METS - FLocat @no
example: File information
modified: 2026-03-12

Files
type: ObjectProperty
domain: Record (alvin-record)
range: Files
label: Filer @sv
definition: Filsektionen innehåller ett eller flera fileGroup-element som används för att gruppera relaterade filer. METS - fileSec @sv
definition: The file section contains one or more fileGroup elements used to group together related files. METS - fileSec
definition: Fildelen inneholder ett eller flere fileGroup-elementer som brukes til å gruppere relaterte filer. METS - fileSec @no
example: File information
modified: 2026-03-12

Final rubric
type: DatatypeProperty
domain: Class
  union of: Record (alvin-record)
  union of: Part
range: Literal
label: Final rubric (slut på textavsnitt) @sv
label: Final rubric (slutten av en tekstdel) @no
definition: Innehåller den sträng av ord som betecknar slutet av en textindelning, ofta med ett påstående om dess författare och titel, vanligtvis avvikande från själva texten med rött bläck, av en annan storlek eller typ av skrift, eller av någon annan sådan visuell effekt. TEI - finalRubric @sv
definition: Contains the string of words that denotes the end of a text division, often with an assertion as to its author and title, usually set off from the text itself by red ink, by a different size or type of script, or by some other such visual device. TEI - finalRubric
definition: Inneholder strengen av ord som betegner slutten av en tekstinndeling, ofte med en påstand om forfatteren og tittelen, vanligvis satt av fra selve teksten med rødt blekk, av en annen størrelse eller type skrift, eller av en annen slik visuell effekt. TEI - finalRubric @no
example: Location information
modified: 2026-03-12

Form of work
type: ObjectProperty
domain: Work (alvin-work)
range: Form of work
label: Verkets form @sv
definition: En klass eller genre som ett verk tillhör. Kan användas för att skilja ett verk från ett annat verk med samma titel. MARC21 - 380 @sv
definition: A class or genre to which a work belongs. May be used to differentiate a work from another work with the same title. MARC21 - 380
definition: En klasse eller sjanger som et verk tilhører. Kan brukes til å skille et verk fra et annet verk med samme tittel. MARC21 - 380 @no
example: Subject term, category and classification information
modified: 2026-03-12

Former shelf mark
type: DatatypeProperty
domain: Physical location
range: Literal
label: Tidigare signum @sv
label: Tidligere hyllemerke @no
definition: Signum där en resurs tidigare funnits, vid omplacering eller en omorganisation av en samling som helhet. MARC21 - 852d @sv
definition: Call numbers/shelf numbers where a resource was previously located, in cases of a relocation or a reordering/reorganisation of a collection as a whole. MARC21 - 852d
definition: Hyllemerker hvor en ressurs tidligere befant seg, ved flytting eller omorganisering av en samlet samling. MARC21 - 852d @no
example: Location information
modified: 2026-03-12

Gender
type: ObjectProperty
domain: Personal information
range: Gender
label: Kön @sv
label: Kjønn @no
definition: Kön. MADS - gender @sv
definition: Gender. MADS - gender
definition: Kjønn. MADS - gender @no
example: Authority information
modified: 2026-03-12

Genre/form
type: ObjectProperty
domain: Class
  union of: Record (alvin-record)
  union of: Work (alvin-work)
range: Genre/form
label: Sjanger/form @no
definition: En eller flera termer som betecknar en kategori som kännetecknar en viss stil, form eller innehåll, såsom konstnärlig, musikalisk, litterär komposition etc. MODS - genre @sv
definition: A term or terms that designate a category characterizing a particular style, form, or content, such as artistic, musical, literary composition, etc. MODS - genre
definition: Et eller flere begreper som betegner en kategori som karakteriserer en bestemt stil, form eller innhold, for eksempel kunstnerisk, musikalsk, litterær komposisjon osv. MODS - genre @no
example: Subject term, category and classification information
modified: 2026-03-12

Genre/form
type: DatatypeProperty
domain: Subject
range: Literal
label: Sjanger/form @no
definition: Form eller genre som en resurs tillhör. BIBFRAME - GenreForm @sv
definition: Form category or genre to which a resource belongs. BIBFRAME - GenreForm
definition: Form eller sjanger som en ressurs tilhører. BIBFRAME - GenreForm @no
example: Subject term, category and classification information
modified: 2026-03-12

Place
type: DatatypeProperty
domain: Class
  union of: Authority
  union of: Variant
range: Literal
label: Plats @sv
label: Sted @no
definition: Namn på geografiska platser. MADS - geographic @sv
definition: Name of geographic entities. MADS - geographic
definition: Navn på geografiske steder. MADS - geographic @no
example: Authority information
modified: 2026-03-12

Geographic coverage
type: DatatypeProperty
domain: Subject
range: Literal
label: Geografisk täckning @sv
label: Geografisk dekning @no
definition: Geografisk täckning av innehållet i resursen. BIBFRAME - GeographicCoverage @sv
definition: Geographic coverage of the content of the resource. BIBFRAME - GeographicCoverage
definition: Geografisk dekning av innholdet i ressursen. BIBFRAME - GeographicCoverage @no
example: Subject term, category and classification information
modified: 2026-03-12

Height/length
type: DatatypeProperty
domain: Class
  union of: Measure
  union of: File
range: Literal
label: Höjd/längd @sv
label: Høyde/lengde @no
definition: Ett mått mätt längs axeln i rät vinkel mot objektets botten. TEI - height @sv
definition: A measurement measured along the axis at a right angle to the bottom of the object. TEI - height
definition: En måling målt langs aksen i rett vinkel til bunnen av objektet. TEI - height @no
example: Carrier information
modified: 2026-03-12

Entity
type: ObjectProperty
domain: Physical location
range: Entity
label: Enhet @sv
definition: Enhet som innehar objektet eller från vilket det är tillgängligt. BIBFRAME - heldBy @sv
definition: Entity holding the item or from which it is available. BIBFRAME - heldBy
definition: Enhet som holder objektet eller som det er tilgjengelig fra. BIBFRAME - heldBy @no
example: Location information
modified: 2026-03-12

Historical countries
type: ObjectProperty
domain: Place of publication or production
range: Historical countries
label: Historiska länder @sv
label: Historiske land @no
definition: Länder och riken som inte längre existerar som självständiga stater. @sv
definition: Countries and kingdoms that no longer exist as independent states.
definition: Land og riker som ikke lenger eksisterer som selvstendige stater. @no
example: Origin information
modified: 2026-03-12

Identifier
type: ObjectProperty
domain: Class
  union of: Record (alvin-record)
  union of: Organisation (alvin-organisation)
  union of: Person (alvin-person)
  union of: Archival institution (alvin-location)
  union of: Component
range: Identifier
label: Identifikator @sv
definition: Ett unikt standardnummer eller kod som specifikt identifierar en resurs. MODS - identifier @sv
definition: A unique standard number or code that distinctively identifies a resource. MODS - identifier
definition: Et unikt standardnummer eller kode som spesifikt identifiserer en ressurs. MODS - identifier @no
example: General property
modified: 2026-03-12

Type
type: ObjectProperty
domain: Identifier
range: Type
label: Typ @sv
definition: Identifierar typen av identifierare som registreras. MODS - identifier/@type @sv
definition: Identifies the type of identifier that is recorded. MODS - identifier/@type
definition: Identifiserer typen identifikator som er registrert. MODS - identifier/@type @no
example: General property
modified: 2026-03-12

Incipit
type: DatatypeProperty
domain: Class
  union of: Record (alvin-record)
  union of: Work (alvin-work)
  union of: Part
range: Literal
label: Incipit (inledande ord) @sv
label: Incipit (innledende ord) @no
definition: Innehåller inledningen av ett manuskript eller liknande föremål, det vill säga inledningsorden i själva texten, exklusive någon rubrik som kan föregå den, av tillräcklig längd för att identifiera verket unikt. TEI - incipit @sv
definition: Contains the incipit of a manuscript or similar object item, that is the opening words of the text proper, exclusive of any rubric which might precede it, of sufficient length to identify the work uniquely; such incipits were, in former times, frequently used a means of reference to a work, in place of a title. TEI - incipit
definition: Inneholder innledningen til et manuskript eller lignende gjenstand, det vil si åpningsordene i teksten, unntatt enhver rubrikk som kan komme foran den, av tilstrekkelig lengde til å identifisere verket unikt. TEI - incipit @no
example: Description information
modified: 2026-03-12

Media type (type)
type: ObjectProperty
domain: File group
range: Media type (type)
label: Mediatyp (typ) @sv
definition: Den elektroniska formattypen eller datarepresentationen för resursen. MODS - internetMediaType @sv
definition: The electronic format type, or the data representation, of the resource. MODS - internetMediaType
definition: Den elektroniske formattypen eller datarepresentasjonen til ressursen. MODS - internetMediaType @no
example: File information
modified: 2026-03-12

Description (label, text)
type: DatatypeProperty
domain: File
range: Literal
label: Beskrivning (etikett, text) @sv
label: Beskrivelse (etikett, tekst) @no
definition: En enkel titelsträng som används för att identifiera filen. METS - @LABEL @sv
definition: A simple title string used to identify the file. METS - @LABEL
definition: En enkel tittelstreng som brukes til å identifisere filen. METS - @LABEL @no
example: File information
modified: 2026-03-12

Language
type: ObjectProperty
domain: Class
  union of: Record (alvin-record)
  union of: Authority
  union of: Variant
  union of: Description/summary
  union of: Part
range: Language
label: Språk @sv
definition: Språk som är kopplat till en resurs eller dess delar. BIBFRAME - language @sv
definition: Language associated with a resource or its parts. BIBFRAME - language
definition: Språk knyttet til en ressurs eller dens deler. BIBFRAME - language @no
example: Language information
modified: 2026-03-12

Latitude
type: DatatypeProperty
domain: Geographical point
range: Literal
label: Latitud @sv
definition: Mäter avståndet norr eller söder om ekvatorn. WGS84 @sv
definition: Measures the distance north or south of the equator. WGS84
definition: Måler avstanden nord eller sør for ekvator. WGS84 @no
example: Description information
modified: 2026-03-12

Legend
type: DatatypeProperty
domain: Class
  union of: Edge description
  union of: Obverse
  union of: Reverse
range: Literal
label: Inskrift @sv
label: Inskripsjon @no
definition: En bokstavlig transkription. NUDS - legend @sv
definition: A literal transcription. NUDS - legend
definition: En bokstavelig transkripsjon. NUDS - legend @no
example: Description information
modified: 2026-03-12

Level
type: ObjectProperty
domain: Class
  union of: Record (alvin-record)
  union of: Component
range: Level
label: Nivå @sv
definition: Den hierarkiska nivån för materialen som beskrivs av elementet. EAD - archdesc@level @sv
definition: The hierarchical level of the materials being described by the element. EAD - archdesc@level
definition: Det hierarkiske nivået til materialene som beskrives av elementet. EAD - archdesc@level @no
example: General property
modified: 2026-03-12

Literature
type: DatatypeProperty
domain: Class
  union of: Record (alvin-record)
  union of: Work (alvin-work)
  union of: Part
range: Literal
label: Litteratur @sv
definition: (Citeringslista) innehåller en lista över bibliografiska referenser av något slag. TEI - listBibl @sv
definition: (Citation list) contains a list of bibliographic citations of any kind. TEI - listBibl
definition: (Siteringsliste) inneholder en liste over bibliografiske referanser av noe slag. TEI - listeBibl @no
example: Description information
modified: 2026-03-12

Archival institution
type: ObjectProperty
domain: Entity
range: Archival institution (alvin-location)
label: Arkivinstitution @sv
label: Arkivinstitusjon @no
definition: Länk till auktoritetspost för arkivinstitution. @sv
definition: Link to an authority record for an archive institution.
definition: Link til autoritetspost for arkivinstitusjon. @no
example: Related information
modified: 2026-03-12

Locus
type: DatatypeProperty
domain: Class
  union of: Record (alvin-record)
  union of: Part
range: Literal
definition: Definierar en plats i ett manuskript, en manuskriptdel eller annat objekt, vanligtvis som en (möjligen diskontinuerlig) sekvens av folioreferenser. TEI - locus @sv
definition: Defines a location within a manuscript, manuscript part, or other object typically as a (possibly discontinuous) sequence of folio references. TEI - locus
definition: Definerer en plassering i et manuskript, en manuskriptdel eller et annet objekt, vanligvis som en (muligens diskontinuerlig) sekvens av folioreferanser. TEI - locus @no
example: Carrier information
modified: 2026-03-12

Longitude
type: DatatypeProperty
domain: Geographical point
range: Literal
label: Longitud @sv
definition: Mäter avstånd öster eller väster om nollmeridianen. WGS84 @sv
definition: Measures distance east or west of the prime meridian. WGS84
definition: Måler avstanden øst eller vest for nollmeridianen. WGS84 @no
example: Description information
modified: 2026-03-12

Main title
type: DatatypeProperty
domain: Class
  union of: Title
  union of: Variant title
range: Literal
label: Huvudtitel @sv
label: Hovedtittel @no
definition: Titel som används. Ett ord, en fras, ett tecken eller en grupp av tecken som utgör huvudtiteln på en resurs, det vill säga den titel som normalt används när resursen citeras. BIBFRAME - mainTitle @sv
definition: Title being addressed. A word, phrase, character, or group of characters that constitutes the chief title of a resource, i.e., the title normally used when citing the resource. BIBFRAME - mainTitle
definition: Tittel som brukes. Et ord, en frase, et tegn eller en gruppe av tegn som utgjør hovedtittelen til en ressurs, dvs. tittelen som vanligvis brukes når ressursen siteres. BIBFRAME - mainTitle @no
example: Title information
modified: 2026-03-12

Weight
type: ObjectProperty
domain: Record (alvin-record)
range: Weight
label: Vikt @sv
label: Vekt @no
definition: Ett ord eller en fras som hänvisar till någon kvantitet av ett föremål eller en vara, vanligtvis bestående av ett nummer, en enhet och ett namn. TEI - measure @sv
definition: A word or phrase referring to some quantity of an object or commodity, usually comprising a number, a unit, and a commodity name. TEI - measure
definition: Et ord eller en setning som refererer til en viss mengde av en gjenstand eller vare, vanligvis bestående av et tall, en enhet og et navn. TEI - measure @no
example: Carrier information
modified: 2026-03-12

Media type
type: DatatypeProperty
domain: File
range: Literal
label: Mediatyp @sv
label: Medietype @no
definition: IANA MIME-medietypen för den associerade filen. METS - @MIMETYPE @sv
definition: The IANA MIME media type for the associated file. METS - @MIMETYPE
definition: IANA MIME-medietypen for den tilknyttede filen. METS - @MIMETYPE @no
example: File information
modified: 2026-03-12

Digits
type: DatatypeProperty
domain: Value
range: Literal
label: Siffror @sv
label: Siffer @no
definition: Det monetära värdet. NUDS - value @sv
definition: The monetary value of an appraisal. NUDS - value
definition: Pengeverdien. NUDS - value @no
example: Description information
modified: 2026-03-12

Month
type: DatatypeProperty
domain: Date
range: Literal
label: Månad @sv
label: Måned @no
definition: Månad. Dateformat - MM @sv
definition: Month. Dateformat - MM
definition: Måned. Dateformat - MM @no
example: Origin information
modified: 2026-03-12

Contents (manuscript)
type: ObjectProperty
domain: Record (alvin-record)
range: Contents (manuscript)
label: Innehåll (handskrift) @sv
label: Innhold (manuskript) @no
definition: Beskriver det intellektuella innehållet i ett manuskript, en manuskriptdel eller annat objekt antingen som en serie stycken eller som en serie strukturerade manuskriptdelar. TEI - msContents @sv
definition: Describes the intellectual content of a manuscript, manuscript part, or other object either as a series of paragraphs or as a series of structured manuscript items. TEI - msContents
definition: Beskriver det intellektuelle innholdet i et manuskript, en manuskriptdel eller et annet objekt enten som en serie avsnitt eller som en serie strukturerte manuskriptelementer. TEI - msContents @no
example: General property
modified: 2026-03-12

Part
type: ObjectProperty
domain: Class
  union of: Contents (manuscript)
  union of: Part
range: Part
label: Del @sv
definition: Beskriver ett enskilt verk eller föremål inom det intellektuella innehållet i ett manuskript, en del av ett manuskript eller annat föremål. TEI - msItem @sv
definition: Describes an individual work or item within the intellectual content of a manuscript, manuscript part, or other object. TEI - msItem
definition: Beskriver et individuelt verk eller element innenfor det intellektuelle innholdet i et manuskript, en del av et manuskript eller et annet objekt. TEI - msItem @no
example: General property
modified: 2026-03-12

Music key
type: ObjectProperty
domain: Class
  union of: Record (alvin-record)
  union of: Work (alvin-work)
range: Music key
label: Tonart @sv
label: Nøkkel @no
definition: Tonhöjd och modus för musik. BIBFRAME - musicKey @sv
definition: Pitch and mode for music. BIBFRAME - musicKey
definition: Tonehøyde og modus for musikk. BIBFRAME - musicKey @no
example: Description information
modified: 2026-03-12

Medium of performance
type: ObjectProperty
domain: Class
  union of: Record (alvin-record)
  union of: Work (alvin-work)
range: Medium of performance
label: Besättning @sv
label: Besetning @no
definition: Instrumental, vokal och/eller annat framförandemedium för vilket en musikalisk resurs ursprungligen utformades, skrevs eller framfördes. BIBFRAME - musicMedium @sv
definition: Instrumental, vocal, and/or other medium of performance for which a musical resource was originally conceived, written or performed. BIBFRAME - musicMedium
definition: Instrumental, vokal og/eller annet fremføringsmedium som en musikalsk ressurs opprinnelig ble unnfanget, skrevet eller fremført for. BIBFRAME - musicMedium @no
example: Description information
modified: 2026-03-12

Notation
type: ObjectProperty
domain: Record (alvin-record)
range: Notation
label: Notationssätt @sv
label: Notasjon @no
definition: Information om symbolsystemet som används för att förmedla innehållet i en musikresurs. BIBFRAME - MusicNotation @sv
definition: Information on the symbol system used to convey the content of a music resource. BIBFRAME - MusicNotation
definition: nformasjon om symbolsystemet som brukes til å formidle innholdet i en musikkressurs. BIBFRAME - MusicNotation @no
example: Description information
modified: 2026-03-12

Opus number
type: DatatypeProperty
domain: Numeric designation
range: Literal
label: Opusnummer @sv
definition: Numerisk beteckning på ett musikverk tilldelat av en kompositör, förläggare eller en musikforskare. BIBFRAME - musicOpusNumber @sv
definition: Numeric designation of a musical work assigned by a composer, publisher, or a musicologist. BIBFRAME - musicOpusNumber
definition: Numerisk betegnelse på et musikalsk verk tildelt av en komponist, forlegger eller en musikkforsker. BIBFRAME - musicOpusNumber @no
example: Description information
modified: 2026-03-12

Serial number
type: DatatypeProperty
domain: Numeric designation
range: Literal
label: Serienummer @sv
definition: Numerisk beteckning för musikaliska verk numrerade i följd i musikreferenskällor. BIBFRAME - musicSerialNumber @sv
definition: Numeric designation for musical works consecutively numbered in music reference sources. BIBFRAME - musicSerialNumber
definition: Numerisk betegnelse for musikkverk fortløpende nummerert i musikkreferansekilder. BIBFRAME - musicSerialNumber @no
example: Description information
modified: 2026-03-12

Thematic index number
type: DatatypeProperty
domain: Numeric designation
range: Literal
label: Nummer från tematisk verkförteckning @sv
label: Nummer fra tematisk verkfortegnelse @no
definition: Numerisk beteckning för ett musikaliskt verk som finns i ett tematiskt register för kompositören. BIBFRAME - musicThematicNumber @sv
definition: Numeric designation for a musical work as found in a thematic index for the composer. BIBFRAME - musicThematicNumber
definition: Numerisk betegnelse for et musikalsk verk som finnes i en tematisk indeks for komponisten. BIBFRAME - musicThematicNumber @no
example: Description information
modified: 2026-03-12

Name
type: ObjectProperty
domain: Class
  union of: Authority
  union of: Variant
range: Name
label: Namn @sv
label: Navn @no
definition: Används för person-, organisations- eller släktnamn. MADS - name @sv
definition: Used for personal, corporate or family names. MADS - name
definition: Brukes for personnavn, organisasjonsnavn eller familienavn. MADS - name @no
example: Authority information
modified: 2026-03-12

Part of a name
type: ObjectProperty
domain: Name
range: Part of a name
label: Del av ett namn @sv
label: Del av et navn @no
definition: De individuellt analyserade delarna som tillsammans utgör det fullständiga namnet. MADS - namePart @sv
definition: The individual parsed parts that together make up the full name. MADS - namePart
definition: De individuelle analyserte delene som til sammen utgjør det fulle navnet. MADS - namePart @no
example: Authority information
modified: 2026-03-12

Nationality
type: ObjectProperty
domain: Personal information
range: Nationality
label: Nationalitet @sv
label: Nasjonalitet @no
definition: Ett land som en person är identifierad med. MADS - nationality @sv
definition: A country with which a person is identified. MADS - nationality
definition: Et land som en person er identifisert med. MADS - nationality @no
example: Authority information
modified: 2026-03-12

Note
type: ObjectProperty
domain: Class
  union of: Record (alvin-record)
  union of: Work (alvin-work)
  union of: Organisation (alvin-organisation)
  union of: Person (alvin-person)
  union of: Physical location
  union of: Other years/dates
  union of: Other physical description
  union of: Part
  union of: Component
range: Note
label: Anmärkning @sv
definition: Information, vanligtvis i textform, om attribut för en resurs eller någon aspekt av en resurs. BIBFRAME - note @sv
definition: Information, usually in textual form, on attributes of a resource or some aspect of a resource. BIBFRAME - note
definition: Informasjon, vanligvis i tekstform, om attributter til en ressurs eller noen aspekter ved en ressurs. BIBFRAME - note @no
example: General property
modified: 2026-03-12

Type of note
type: ObjectProperty
domain: Note
range: Type of note
label: Typ av anmärkning @sv
label: Type av note @no
definition: Typ av anmärkning. BIBFRAME - noteType @sv
definition: Type of note. BIBFRAME - noteType
definition: Type av note. BIBFRAME - noteType @no
example: General property
modified: 2026-03-12

Numeric designation
type: ObjectProperty
domain: Work (alvin-work)
range: Numeric designation
label: Numerisk beteckning @sv
label: Numerisk betegnelse @no
definition: Ett serienummer, opusnummer eller tematiskt indexnummer som tilldelats ett musikverk av kompositören, förläggaren eller en musikforskare. Kan användas för att skilja ett musikaliskt verk från ett annat med samma titel. MARC21 - 383 @sv
definition: A serial number, opus number, or thematic index number assigned to a musical work by the composer, publisher, or a musicologist. May be used to differentiate a musical work from another with the same title. MARC21 - 383
definition: Tekst Et serienummer, opusnummer eller tematisk indeksnummer tildelt et musikkverk av komponisten, utgiveren eller en musikkforsker. Kan brukes til å skille et musikkverk fra et annet med samme tittel. MARC21 - 383 @no
example: Description information
modified: 2026-03-12

Obverse
type: ObjectProperty
domain: Record (alvin-record)
range: Obverse
label: Åtsida @sv
label: Advers @no
definition: För kodning av typologiska attribut på åtsidan av ett mynt. NUDS - obverse @sv
definition: For encoding typological attributes about the obverse of a coin. NUDS - obverse
definition: For koding av typologiske attributter på forsiden av en mynt. NUDS - obverse @no
example: Description information
modified: 2026-03-12

Occupation
type: DatatypeProperty
domain: Subject
range: Literal
label: Yrkesterm @sv
label: Yrke @no
definition: Ett yrke som beskrivs av resursen. MODS - occupation @sv
definition: An occupation described by the resource. MODS - occupation
definition: Et yrke beskrevet av ressursen. MODS - occupation @no
example: Subject term, category and classification information
modified: 2026-03-12

Organisation
type: ObjectProperty
domain: Class
  union of: Agent
  union of: Related
range: Organisation (alvin-organisation)
label: Organisasjon @no
definition: Länk till auktoritetspost för organisation. @sv
definition: Link to an authority record for an organisation.
definition: Link til autoritetspost for organisasjon. @no
example: Related information
modified: 2026-03-12

Organisation information
type: ObjectProperty
domain: Class
  union of: Organisation (alvin-organisation)
  union of: Archival institution (alvin-location)
range: Organisation information
label: Organisationsinformation @sv
label: Organisasjonsinformasjon @no
definition: En behållare för organisationsnamn. Det inkluderar underelement som specifikt relaterar till organisationen som namnges av det elementet. - MADS - organizationInfo @sv
definition: A container element for organisation names. It includes subelements that relate specifically to the organisation named by that element. - MADS - organizationInfo
definition: En beholder for organisasjonsnavn. Det inkluderer underelementer som er spesifikt relatert til organisasjonen som er navngitt av det elementet. - MADS - organizationInfo @no
example: Authority information
modified: 2026-03-12

Text direction
type: ObjectProperty
domain: Class
  union of: Title
  union of: Variant title
  union of: Name
range: Text direction
label: Textriktning @sv
label: Tekstretning @no
definition: Anges när titeln eller namnet innehåller text som har en riktning från höger till vänster. MARC21 - Control Subfields @sv
definition: Set when the title or the name contains text that has a right-to-left orientation. MARC21 - Control Subfields
definition: Angis når tittelen eller navnet inneholder tekst som har retning fra høyre til venstre. MARC21 - Control Subfields @no
example: General property
modified: 2026-03-12

Origin date
type: ObjectProperty
domain: Class
  union of: Record (alvin-record)
  union of: Work (alvin-work)
  union of: Part
  union of: Component
range: Origin date
label: Tillkomsttid @sv
label: Tilkomsttid @no
definition: Datum eller datumintervall kopplat till skapandet av ett verk. BIBFRAME - originDate @sv
definition: Date or date range associated with the creation of a work. BIBFRAME - originDate
definition: Dato eller datoperiode knyttet til opprettelsen av et verk. BIBFRAME - originDate @no
example: Origin information
modified: 2026-03-12

Place of publication or production
type: ObjectProperty
domain: Class
  union of: Record (alvin-record)
  union of: Work (alvin-work)
  union of: Part
range: Place of publication or production
label: Utgivnings- eller tillverkningsplats @sv
label: Sted for utgivelse eller produksjon @no
definition: Plats där skapandet av resursen har sitt ursprung. BIBFRAME - originPlace @sv
definition: Place from which the creation of the resource originated. BIBFRAME - originPlace
definition: Stedet hvor ressursen ble opprettet. BIBFRAME - originPlace @no
example: Origin information
modified: 2026-03-12

Original filename
type: DatatypeProperty
domain: File
range: Literal
label: Originalfilnamn @sv
label: Opprinnelig filnavn @no
definition: Namnet på objektet som det skickats till eller samlats in av arkivet, innan eventuellt namnbyte i arkivet. PREMIS - originalName @sv
definition: The name of the object as submitted to or harvested by the repository, before any renaming by the repository. PREMIS - originalName
definition: Navnet på objektet slik det ble sendt til eller samlet inn av arkivet, før noen navneendring i arkivet. PREMIS - originalName @no
example: File information
modified: 2026-03-12

Other finding aids
type: DatatypeProperty
domain: Record (alvin-record)
range: Literal
label: Andra sökhjälpmedel @sv
label: Andre fremfinningsverktøy @no
definition: För att identifiera andra hjälpmedel för att hitta materialet som beskrivs. EAD - otherfindaid @sv
definition: For identifying any other finding aids to the materials being described. EAD - otherfindaid
definition: For å identifisere eventuelle andre hjelpemidler til materialene som beskrives. EAD - otherfindaid @no
example: Description information
modified: 2026-03-12

Part
type: ObjectProperty
domain: Related record in Alvin
range: Part
label: Del @sv
definition: Del av en resurs som informationen gäller. BIBFRAME - part @sv
definition: Part of a resource to which information applies. BIBFRAME - part
definition: Del av en ressurs som informasjonen gjelder. BIBFRAME - part @no
example: Related information
modified: 2026-03-12

Number or designation
type: DatatypeProperty
domain: Part
range: Literal
label: Nummer eller beteckning @sv
label: Nummer eller betegnelse @no
definition: Numrering av delar eller avsnitt. BIBFRAME -partNumber @sv
definition: Part or section enumeration. BIBFRAME - partNumber
definition: Nummerering av deler eller seksjoner. BIBFRAME - partNumber @no
example: Related information
modified: 2026-03-12

Type
type: ObjectProperty
domain: Part
range: Type
label: Typ @sv
definition: Typ av del. MODS - @type @sv
definition: The type of part. MODS - @type
definition: Type av del. MODS - @type @no
example: Related information
modified: 2026-03-12

Person
type: ObjectProperty
domain: Agent
range: Person (alvin-person)
definition: Länk till auktoritetspost för person. @sv
definition: Link to an authority record for a person.
definition: Link til autoritetspost for person. @no
example: Related information
modified: 2026-03-12

Personal information
type: ObjectProperty
domain: Person (alvin-person)
range: Personal information
label: Personinformation @sv
label: Personopplysninger @no
definition: En behållare för personnamn. Det inkluderar underelement som specifikt relaterar till personen som namnges av det elementet. - MADS - personInfo @sv
definition: A container element for person names. It includes subelements that relate specifically to the person named by that element. - MADS - personInfo
definition: En beholder for personnavn. Det inkluderer underelementer som er spesifikt relatert til personen som er navngitt av det elementet. - MADS - personInfo @no
example: Authority information
modified: 2026-03-12

Other physical description
type: ObjectProperty
domain: Class
  union of: Record (alvin-record)
  union of: Part
range: Other physical description
label: Övrig fysisk beskrivning @sv
label: Annen fysisk beskrivelse @no
definition: En behållare för underelement som används för den fysiska beskrivningen av resursen. MODS - physicalDescription @sv
definition: A container element for subelements used for the physical description of the resource. MODS - physicalDescription
definition: En beholder for underelementer som brukes for den fysiske beskrivelsen av ressursen. MODS - physicalDescription @no
example: Carrier information
modified: 2026-03-12

Physical location
type: ObjectProperty
domain: Record (alvin-record)
range: Physical location
label: Fysisk placering @sv
label: Fysisk plassering @no
definition: Identifierar organisationen som äger objektet eller från vilket det är tillgängligt. Kan också innehålla detaljerad information om hur man hittar föremålet i en samling. MARC21 - 852 @sv
definition: Identifies the organization holding the item or from which it is available. May also contain detailed information about how to locate the item in a collection. MARC21 - 852
definition: Identifiserer organisasjonen som eier objektet eller som det er tilgjengelig fra. Kan også inneholde detaljert informasjon om hvordan du finner gjenstanden i en samling. MARC21 - 852 @no
example: Location information
modified: 2026-03-12

Place
type: ObjectProperty
domain: Class
  union of: Place of publication or production
  union of: Address
  union of: Place of birth
  union of: Place of death
  union of: Component
range: Place (alvin-place)
label: Plats @sv
label: Sted @no
definition: Länk till auktoritetspost för plats. @sv
definition: Link to an authority record for a place.
definition: Link til autoritetspost for sted. @no
example: Related information
modified: 2026-03-12

Geographical point
type: ObjectProperty
domain: Class
  union of: Work (alvin-work)
  union of: Place (alvin-place)
  union of: Archival institution (alvin-location)
range: Geographical point
label: Geografisk punkt @sv
definition: En punkt som beskrivs med hjälp av ett koordinatsystem relativt till jorden. WGS84 @sv
definition: A point, described using a coordinate system relative to Earth. WGS84
definition: Et punkt, beskrevet ved hjelp av et koordinatsystem i forhold til Jorden. WGS84 @no
example: Description information
modified: 2026-03-12

Post office box
type: DatatypeProperty
domain: Address
range: Literal
label: Postbox @sv
label: Postboks @no
definition: Postbox @sv
definition: Post office box
definition: Postboks @no
example: Authority information
modified: 2026-03-12

Postcode
type: DatatypeProperty
domain: Address
range: Literal
label: Postnummer @sv
definition: Postnummer. MADS - postcode @sv
definition: Postcode. MADS - postcode
example: Authority information
modified: 2026-03-12

Production method
type: ObjectProperty
domain: Record (alvin-record)
range: Production method
label: Produktionsmetod @sv
label: Produksjonsmetode @no
definition: Process som används för att producera en resurs. BIBFRAME - productionMethod @sv
definition: Process used to produce a resource. BIBFRAME - productionMethod
definition: Prosess som brukes til å produsere en ressurs. BIBFRAME - productionMethod @no
example: General property
modified: 2026-03-12

Projection
type: DatatypeProperty
domain: Cartographic data
range: Literal
label: Projektion @sv
label: Projisering @no
definition: Metod eller system som används för att representera jordens yta eller en himmelssfär på ett plan. BIBFRAME - projection @sv
definition: Method or system used to represent the surface of the earth or of a celestial sphere on a plane. BIBFRAME - projection
definition: Metode eller system som brukes til å representere overflaten av jorden eller en himmelkule på et plan. BIBFRAME - projection @no
example: Description information
modified: 2026-03-12

Publication (publisher, imprint)
type: DatatypeProperty
domain: Record (alvin-record)
range: Literal
label: Utgivning (förlag, impressum) @sv
label: Utgivelse (forlag, imprint) @no
definition: Information om publicering av en resurs. BIBFRAME - Publication @sv
definition: Information relating to publication of a resource. BIBFRAME - Publication
definition: Informasjon knyttet til publisering av en ressurs. BIBFRAME - Publication @no
example: Description information
modified: 2026-03-12

Record
type: ObjectProperty
domain: Related record in Alvin
range: Record (alvin-record)
label: Post @sv
definition: Länk till en relaterad post i Alvin. @sv
definition: Link to a related record in Alvin.
definition: Link til en relatert post i Alvin. @no
example: Related information
modified: 2026-03-12

Date of change (record)
type: DatatypeProperty
domain: Record information
range: Literal
label: Ändringsdatum (post) @sv
label: Dato for endring (post) @no
definition: Datum och tid då den ursprungliga Alvin-posten senast ändrades. MODS - recordChangeDate @sv
definition: The date and time when the original Alvin record was last modified. MODS - recordChangeDate
definition: Datoen og klokkeslettet da den originale Alvin-posten sist ble endret. MODS - recordChangeDate @no
example: Administrative information
modified: 2026-03-12

Date of registration (record)
type: DatatypeProperty
domain: Record information
range: Literal
label: Registreringsdatum (post) @sv
label: Dato for registrering (post) @no
definition: Datum och tid då den ursprungliga Alvin-posten först skapades. MODS - recordCreationDate @sv
definition: The date and time when the original Alvin record was first created. MODS - recordCreationDate
definition: Datoen og klokkeslettet da den originale Alvin-posten først ble opprettet. MODS - recordCreationDate @no
example: Administrative information
modified: 2026-03-12

Identifier (record)
type: DatatypeProperty
domain: Record information
range: Literal
label: Identifikator (post) @sv
definition: Innehåller systemkontrollnumret som tilldelats av organisationen som skapar, använder eller distribuerar posten. MODS - recordIdentifier @sv
definition: Contains the system control number assigned by the organization creating, using, or distributing the record. MODS - recordIdentifier
definition: Inneholder systemkontrollnummeret som er tildelt av organisasjonen som oppretter, bruker eller distribuerer posten. MODS - recordIdentifier @no
example: Administrative information
modified: 2026-03-12

Record information
type: ObjectProperty
domain: Class
  union of: Record (alvin-record)
  union of: Work (alvin-work)
  union of: Place (alvin-place)
  union of: Person (alvin-person)
  union of: Organisation (alvin-organisation)
  union of: Archival institution (alvin-location)
range: Record information
label: Postinformation @sv
label: Postinformasjon @no
definition: En behållare som innehåller underelement relaterade till information som är nödvändig för att hantera metadata. MODS - recordInfo @sv
definition: A container element that includes subelements relating to information necessary for managing metadata. MODS - recordInfo
definition: En beholder som inkluderer underelementer relatert til informasjon som er nødvendig for å administrere metadata. MODS - recordInfo @no
example: Administrative information
modified: 2026-03-12

Related
type: ObjectProperty
domain: Class
  union of: Organisation (alvin-organisation)
  union of: Person (alvin-person)
range: Related
label: Relaterad @sv
label: Relatert @no
definition: Inkluderar ett namn eller en term som har en relation till den auktoriserade formen. MADS - related @sv
definition: Includes a name or term that has some relation to the authoritative form. MADS - related
definition: Inkluderer et navn eller en term som har en relasjon til den autoriserte formen. MADS - related @no
example: Authority information
modified: 2026-03-12

Related record in Alvin
type: ObjectProperty
domain: Class
  union of: Record (alvin-record)
  union of: Part
  union of: Component
range: Related record in Alvin
label: Relaterad post i Alvin @sv
label: Relatert post i Alvin @no
definition: Varje relation med andra poster i Alvin. BIBFRAME - relatedTo @sv
definition: Any relationship with other records in Alvin. BIBFRAME - relatedTo
definition: Ethvert forhold til andre poster i Alvin . BIBFRAME - relatedTo @no
example: Related information
modified: 2026-03-12

Type of relation
type: ObjectProperty
domain: Related record in Alvin
range: Type of relation
label: Typ av relation @sv
label: Type relasjon @no
definition: Relationen mellan den relaterade resursen och den resurs som beskrivs. MODS - relatedItem/@type @sv
definition: The relationship between the related resource and the resource being described. MODS - relatedItem/@type
definition: Forholdet mellom den relaterte ressursen og ressursen som beskrives. MODS - relatedItem/@type @no
example: Related information
modified: 2026-03-12

Related archives outside Alvin
type: DatatypeProperty
domain: Record (alvin-record)
range: Literal
label: Relaterade arkiv utanför Alvin @sv
label: Relaterte arkiver utenfor Alvin @no
definition: För att identifiera arkivmaterial som har en koppling till det material som beskrivs. EAD - relaterat material @sv
definition: For identifying archival materials that have an association to the materials being described. EAD - relatedmaterial
definition: For å identifisere arkivmateriale som har en assosiasjon til materialene som beskrives. EAD - relatedmaterial @no
example: Description information
modified: 2026-03-12

Reverse
type: ObjectProperty
domain: Record (alvin-record)
range: Reverse
label: Frånsida @sv
label: Revers @no
definition: För kodning av typologiska attribut på frånsidan av ett mynt. NUDS - reverse @sv
definition: For encoding typological attributes about the reverse of a coin. NUDS - reverse
definition: For koding av typologiske attributter om baksiden av en mynt. NUDS - reverse @no
example: Description information
modified: 2026-03-12

Rights
type: ObjectProperty
domain: Files
range: Rights
label: Rättigheter @sv
label: Rettigheter @no
definition: Information om rättigheter knutna till resursen. DC - rights @sv
definition: Information about rights held in and over the resource. DC - rights
definition: Informasjon om rettigheter knyttet til ressursen. DC - rights @no
example: File information
modified: 2026-03-12

Role
type: ObjectProperty
domain: Agent
range: Role
label: Roll @sv
label: Rolle @no
definition: Funktion tillhandahållen av en bidragsgivare, t.ex. författare, illustratör, etc. BIBFRAME - role @sv
definition: Function provided by a contributor, e.g., author, illustrator, etc. BIBFRAME - role
definition: Funksjon levert av en bidragsyter, f.eks. forfatter, illustratør osv. BIBFRAME - role @no
example: Agent information
modified: 2026-03-12

Rubric
type: DatatypeProperty
domain: Class
  union of: Record (alvin-record)
  union of: Part
range: Literal
label: Rubric (rubrik, början av textavsnitt) @sv
label: Rubric (overskrift, begynnelsen av tekstdelen) @no
definition: Innehåller texten till valfri rubrik eller rubrik som är kopplad till ett visst manuskriptobjekt, det vill säga en rad ord genom vilka ett manuskript eller annat objekt signalerar början på en textdel, ofta med ett påstående om dess författare och titel, som på något sätt avviker från själva texten, vanligtvis med rött bläck, eller genom att använda olika storlek eller typ av skrift, eller någon annan sådan visuell effekt. TEI - rubric @sv
definition: Contains the text of any rubric or heading attached to a particular manuscript item, that is, a string of words through which a manuscript or other object signals the beginning of a text division, often with an assertion as to its author and title, which is in some way set off from the text itself, typically in red ink, or by use of different size or type of script, or some other such visual device. TEI - rubric
definition: Inneholder teksten til en hvilken som helst tittel eller tittel knyttet til et bestemt manuskriptobjekt, det vil si en rekke ord som et manuskript eller annet objekt signaliserer begynnelsen på en tekstdel, ofte med en uttalelse om forfatteren og tittelen, som i noen måte avviker fra selve teksten, vanligvis med rødt blekk, eller ved å bruke en annen størrelse eller type skrift, eller en annen slik visuell effekt. TEI - rubric @no
example: Description information
modified: 2026-03-12

Scale
type: DatatypeProperty
domain: Cartographic data
range: Literal
label: Skala @sv
definition: Förhållandet mellan dimensionerna för en form som finns eller ingår i en resurs och dimensionerna för den enhet den representerar. BIBFRAME - scale @sv
definition: Ratio of the dimensions of a form contained or embodied in a resource to the dimensions of the entity it represents. BIBFRAME - scale
definition: Forholdet mellom dimensjonene til et skjema inneholdt eller nedfelt i en ressurs og dimensjonene til enheten den representerer. BIBFRAME - scale @no
example: Description information
modified: 2026-03-12

Area
type: ObjectProperty
domain: Measure
range: Area
label: Yta @sv
label: Areal @no
definition: Om mätningen omfattar mer än en yta, specificeras denna mätning. TEI – dimensions/@scope @sv
definition: Where the measurement summarizes more than one observation, specifies the applicability of this measurement. TEI – dimensions/@scope
definition: Hvis målingen dekker mer enn én overflate, er denne målingen spesifisert. TEI – dimensions/@scope @no
example: Carrier information
modified: 2026-03-12

Shelf mark
type: DatatypeProperty
domain: Physical location
range: Literal
label: Signum @sv
label: Hyllemerke @no
definition: Föremålets hyllplats i den ägande organisationens samling. Den kan användas för att ange den fysiska platsen inom en samling; till exempel referensdisk, folianter. Beskrivningen av hyllplatsen ges i sin helhet eller i standardiserad förkortad eller kodad form. MARC21 - 852c @sv
definition: Shelving location of the item within the collection of the holding organisation. It may be used to indicate the physical location within a sublocation; for example, reference alcove, oversize shelving. The description of the shelving location is given in full or in a standardised abbreviated or coded form. MARC21 - 852c
definition: Hylleplassering av gjenstanden i samlingen til eierorganisasjonen. Den kan brukes til å angi den fysiske plasseringen innenfor en samling; for eksempel referansepult, folianter. Beskrivelsen av hylleplasseringen er gitt i sin helhet eller i standardisert forkortet eller kodet form. MARC21 - 852c @no
example: Location information
modified: 2026-03-12

File size
type: DatatypeProperty
domain: File
range: Literal
label: Filstorlek @sv
label: Filstørrelse @no
definition: Anger storleken i byte för den associerade filen. METS - @SIZE @sv
definition: Specifies the size in bytes of the associated file. METS - @SIZE
definition: Angir størrelsen i byte på den tilknyttede filen. METS - @SIZE @no
example: File information
modified: 2026-03-12

Start date/A single date
type: ObjectProperty
domain: Class
  union of: Origin date
  union of: Other years/dates
  union of: Organisation information
range: Date
label: Startdatum/Ett enda datum @sv
label: Startdato/En enkelt dato @no
definition: Startdatum för en händelse. Sammanhanget definieras på en högre nivå. Används också för ett enda datum. MADS - startDate @sv
definition: Start date for an event. The context is defined at a higher level. Also used for a single date. MADS - startDate
definition: Startdato for en hendelse. Konteksten er definert på et høyere nivå. Brukes også for en enkelt dato. MADS - startDate @no
example: Location information
modified: 2026-03-12

Street
type: DatatypeProperty
domain: Address
range: Literal
label: Gata @sv
label: Gate @no
definition: Gatuadress. MADS - street @sv
definition: Street address. MADS - street
definition: Gateadresse. MADS - street @no
example: Authority information
modified: 2026-03-12

Collection
type: ObjectProperty
domain: Physical location
range: Collection
label: Samling @sv
definition: Specifik avdelning, bibliotek etc. inom den ägarorganisationen där föremålet finns eller från vilket det är tillgängligt. Namnet anges i kodad form. MARC21 - 852b @sv
definition: Specific department, library, etc., within the holding organization in which the item is located or from which it is available. Name is given in coded form. MARC21 - 852b
definition: Spesifikk avdeling, bibliotek etc. innenfor eierorganisasjonen hvor gjenstanden befinner seg eller er tilgjengelig fra. Navnet legges inn i kodet form. MARC21 - 852b @no
example: Location information
modified: 2026-03-12

Subject
type: ObjectProperty
domain: Record (alvin-record)
range: Subject
label: Ämnesord @sv
label: Emneord @no
definition: Ämnesord som beskriver en resurs. BIBFRAME - subject. @sv
definition: Subject term(s) describing a resource. BIBFRAME - subject.
definition: Emneord som beskriver en ressurs. BIBFRAME - subject. @no
example: Subject term, category and classification information
modified: 2026-03-12

Sublocation
type: DatatypeProperty
domain: Physical location
range: Literal
label: Placering @sv
label: Plassering @no
definition: Specifik avdelning, bibliotek etc. inom den ägande organisation där föremålet finns eller från vilket det är tillgängligt. Namnet anges i sin helhet eller i lokalt standardiserad förkortad form. MARC21 - 852b @sv
definition: Specific department, library, etc., within the holding organisation in which the item is located or from which it is available. Name is given in full or in a locally standardised abbreviated form. MARC21 - 852b
definition: Spesifikk avdeling, bibliotek etc. innenfor den eierorganisasjonen objektet befinner seg i eller er tilgjengelig fra. Navn oppgis i sin helhet eller i en lokalt standardisert forkortet form. MARC21 - 852b @no
example: Location information
modified: 2026-03-12

Subtitle
type: DatatypeProperty
domain: Class
  union of: Title
  union of: Variant title
range: Literal
label: Undertitel @sv
label: Undertittel @no
definition: Ord, tecken eller grupp av ord och/eller tecken som innehåller resten av titeln efter huvudtiteln. BIBFRAME - subtitle @sv
definition: Word, character, or group of words and/or characters that contains the remainder of the title after the main title. BIBFRAME - subtitle
definition: Ord, tegn eller gruppe med ord og/eller tegn som inneholder resten av tittelen etter hovedtittelen. BIBFRAME - subtitle @no
example: Title information
modified: 2026-03-12

Description/summary
type: ObjectProperty
domain: Class
  union of: Record (alvin-record)
  union of: Archival institution (alvin-location)
range: Description/summary
label: Beskrivning/sammanfattning @sv
label: Beskrivelse/sammendrag @no
definition: Sammanfattning eller kort beskrivning av den beskrivna resursen. BIBFRAME - summary @sv
definition: Summary or abstract of the resource described. BIBFRAME - summary
definition: Sammendrag eller kort beskrivelse av ressursen som er beskrevet. BIBFRAME - summary @no
example: General property
modified: 2026-03-12

Table of contents
type: DatatypeProperty
domain: Record (alvin-record)
range: Literal
label: Innehållsförteckning @sv
label: Innholdsfortegnelse @no
definition: Innehållsförteckning för den beskrivna resursen. BIBFRAME - tableOfContents @sv
definition: Table of contents of the described resource. BIBFRAME - tableOfContents
definition: Innholdsfortegnelse for den beskrevne ressursen. BIBFRAME - tableOfContents @no
example: Description information
modified: 2026-03-12

Time
type: DatatypeProperty
domain: Subject
range: Literal
label: Tid @sv
definition: Kronologisk period. BIBFRAME - Temporal @sv
definition: Chronological period. BIBFRAME - Temporal
definition: Kronologisk periode. BIBFRAME - Temporal @no
example: Subject term, category and classification information
modified: 2026-03-12

Title
type: ObjectProperty
domain: Class
  union of: Record (alvin-record)
  union of: Work (alvin-work)
  union of: Part
  union of: Component
range: Title
label: Titel @sv
label: Tittel @no
definition: Namnet på en resurs. BIBFRAME - title @sv
definition: Name given to a resource. BIBFRAME - title
definition: Navn gitt til en ressurs. BIBFRAME - title @no
example: Title information
modified: 2026-03-12

Topic
type: DatatypeProperty
domain: Subject
range: Literal
label: Ämne @sv
label: Emne @no
definition: Begrepp eller kunskapsområde. BIBFRAME - Topic @sv
definition: Concept or area of knowledge. BIBFRAME - Topic
definition: Konsept eller kunnskapsområde. BIBFRAME - Topic @no
example: Description information
modified: 2026-03-12

Transcription
type: DatatypeProperty
domain: Record (alvin-record)
range: Literal
label: Transkription @sv
label: Transkripsjon @no
definition: En transkription av ett källdokument. TEI - sourceDoc @sv
definition: A transcription of a single source document. TEI - sourceDoc
definition: En transkripsjon av et kildedokument. TEI - sourceDoc @no
example: Description information
modified: 2026-03-12

Type
type: ObjectProperty
domain: Class
  union of: Name
  union of: Part of a name
  union of: Related
range: Type
label: Typ @sv
definition: Typ av namn. MODS - @type @sv
definition: The type of name. MODS - @type
definition: Navnetype. MODS - @type @no
example: General property
modified: 2026-03-12

Resource type
type: ObjectProperty
domain: Record (alvin-record)
range: Resource type
label: Resurstyp @sv
label: Ressurstype @no
definition: En term som specificerar egenskaperna och den allmänna typen av innehåll för resursen. MODS - typeOfResource @sv
definition: A term that specifies the characteristics and general type of content of the resource. MODS - typeOfResource
definition: Et begrep som spesifiserer egenskapene og den generelle typen innhold til ressursen. MODS - typeOfResource @no
example: Subject term, category and classification information
modified: 2026-03-12

Unit of measurement
type: ObjectProperty
domain: Class
  union of: Measure
  union of: Weight
range: Unit of measurement
label: Måttenhet @sv
label: Måleenhet @no
definition: Namnger enheten som används för mätningen. TEI – dimensions/@unit @sv
definition: Names the unit used for the measurement. TEI – dimensions/@unit
definition: Navngir enheten som brukes for målingen. TEI – dimensions/@unit @no
example: Carrier information
modified: 2026-03-12

Container/Shelfmark
type: DatatypeProperty
domain: Component
range: Literal
label: Behållare/Signum @sv
label: Beholder/Hyllemarkering @no
definition: ID för enheten. Tillhandahåller en identifierare för materialet som beskrivs. EAD - unitid @sv
definition: ID of the unit. Provides an identifier for the materials being described. EAD - unitid
definition: ID for enheten. Gir en identifikator for materialene som beskrives. EAD - unitid @no
example: General property
modified: 2026-03-12

URL
type: DatatypeProperty
domain: External location (URL)
range: Literal
definition: Inkluderar alla webbadresser som är kopplade till den enhet som beskrivs i posten. Det rekommenderas att alla webbadresser som används med elementet är beständiga. MADS - url @sv
definition: Includes any URL associated with the entity described in the record. It is recommended that all URLs used with the element be persistent. MADS - url
definition: Inneholder enhver URL tilknyttet enheten beskrevet i posten. Det anbefales at alle nettadresser som brukes med elementet er bestandige. MADS - url @no
example: Related information
modified: 2026-03-12

Variant
type: ObjectProperty
domain: Class
  union of: Person (alvin-person)
  union of: Organisation (alvin-organisation)
  union of: Place (alvin-place)
range: Variant
definition: En hänvisning till ett namn som inte anses vara den auktoriserade formen. MADS - variant @sv
definition: A reference to a name that is not considered the authorised form. MADS - variant
definition: En referanse til et navn som ikke anses som den autoriserte formen. MADS - variant @no
example: Authority information
modified: 2026-03-12

Variant title
type: ObjectProperty
domain: Class
  union of: Record (alvin-record)
  union of: Work (alvin-work)
range: Variant title
label: Varianttitel @sv
label: Varianttittel @no
definition: Titel kopplad till resursen som skiljer sig från titeln. BIBFRAME - VariantTitle @sv
definition: Title associated with the resource that is different from the title. BIBFRAME - VariantTitle
definition: Tittel knyttet til ressursen som er forskjellig fra tittelen. BIBFRAME - VariantTitle @no
example: Title information
modified: 2026-03-12

Type of variation
type: ObjectProperty
domain: Class
  union of: Variant title
  union of: Variant
range: Type of variation
label: Typ av variant @sv
label: Type variant @no
definition: Typ av variant. BIBFRAME - variantType @sv
definition: Type of variation. BIBFRAME - variantType
definition: Type variant. BIBFRAME - variantType @no
example: Title information
modified: 2026-03-12

Weeding
type: DatatypeProperty
domain: Record (alvin-record)
range: Literal
label: Gallring @sv
label: Arkivrydding @no
definition: Ett element för att dokumentera beslut och handlingar relaterade till bedömning av arkivvärde och disposition av det material som beskrivs. EAD - appraisal @sv
definition: An element for documenting decisions and actions related to assessing the archival value and disposition of the materials being described. EAD - appraisal
definition: Et element for å dokumentere beslutninger og handlinger knyttet til vurdering av arkivverdi og disponering av materialene som beskrives. EAD - appraisal @no
example: Description information
modified: 2026-03-12

Weight
type: DatatypeProperty
domain: Weight
range: Literal
label: Vikt @sv
label: Vekt @no
definition: Vikt kodad i decimaltal. NUDS - weight @sv
definition: Weight encoded in decimal numbers. NUDS - weight
definition: Vekt kodet i desimaltall. NUDS - weight @no
example: Carrier information
modified: 2026-03-12

Width
type: DatatypeProperty
domain: Class
  union of: Measure
  union of: File
range: Literal
label: Bredd @sv
label: Bredde @no
definition: Ett mått på ett föremål längs axeln parallellt med dess botten. TEI - width @sv
definition: A measurement of an object along the axis parallel to its bottom. TEI - width
definition: En måling av et objekt langs aksen parallelt med bunnen. TEI - width @no
example: Carrier information
modified: 2026-03-12

Work
type: ObjectProperty
domain: Record (alvin-record)
range: Work (alvin-work)
label: Verk @sv
definition: Länk till auktoritetspost för verk. @sv
definition: Link to an authority record for a work.
definition: Link til autoritetspost for verk. @no
example: Related information
modified: 2026-03-12

Year
type: DatatypeProperty
domain: Date
range: Literal
label: År @sv
definition: År. Dateformat - YYYY @sv
definition: Year. Dateformat - YYYY
example: Origin information
modified: 2026-03-12