Record (alvin-record)
type: Class
label: Post (alvin-record) @sv
definition: Bibliografisk post i Alvin. MARCXML - record @sv
definition: Bibliographic record in Alvin. MARCXML - record
modified: 2026-03-12

Agent
type: ObjectProperty
domain: Class
  union of: Record (alvin-record)
  union of: Work
  union of: MsItem
  union of: Component
range: Agent
definition: Enhet som har en roll i en resurs, till exempel en person eller organisation. BIBFRAME - Agent @sv
definition: Entity having a role in a resource, such as a person or organisation. BIBFRAME - Agent
definition: Enhet som har en rolle i en ressurs, for eksempel en person eller organisasjon. BIBFRAME - Agent @no
example: Agent information
modified: 2026-03-12

Other years/dates
type: ObjectProperty
domain: Class
  union of: Record (alvin-record)
  union of: Work
range: DateOther
label: Övriga år/datum @sv
label: Andre år/datoer @no
definition: Ett datum som inte tillhör någon annan kategori men som är viktigt att registrera. MODS - dateOther @sv
definition: A date that does not fall into another category but is important to record. MODS - dateOther
definition: En dato som ikke faller inn i en annen kategori, men som er viktig å registrere. MODS - dateOther @no
example: Origin information
modified: 2026-03-12

External location (URL)
type: ObjectProperty
domain: Class
  union of: Record (alvin-record)
  union of: Organisation
  union of: Person
  union of: Location
  union of: Component
range: ElectronicLocator
label: Extern länk (URL) @sv
label: Ekstern adresse (URL) @no
definition: Elektronisk adress från vilken resursen är tillgänglig. BIBFRAME - electronicLocator @sv
definition: Electronic location from which the resource is available. BIBFRAME - electronicLocator
definition: Elektronisk adresse som ressursen er tilgjengelig fra. BIBFRAME - electronicLocator @no
example: Related information
modified: 2026-03-12

Genre/form
type: ObjectProperty
domain: Class
  union of: Record (alvin-record)
  union of: Work
range: Genre
label: Sjanger/form @no
definition: En eller flera termer som betecknar en kategori som kännetecknar en viss stil, form eller innehåll, såsom konstnärlig, musikalisk, litterär komposition etc. MODS - genre @sv
definition: A term or terms that designate a category characterizing a particular style, form, or content, such as artistic, musical, literary composition, etc. MODS - genre
definition: Et eller flere begreper som betegner en kategori som karakteriserer en bestemt stil, form eller innhold, for eksempel kunstnerisk, musikalsk, litterær komposisjon osv. MODS - genre @no
example: Subject term, category and classification information
modified: 2026-03-12

Identifier
type: ObjectProperty
domain: Class
  union of: Record (alvin-record)
  union of: Organisation
  union of: Person
  union of: Location
  union of: Component
range: Identifier
label: Identifikator @sv
definition: Ett unikt standardnummer eller kod som specifikt identifierar en resurs. MODS - identifier @sv
definition: A unique standard number or code that distinctively identifies a resource. MODS - identifier
definition: Et unikt standardnummer eller kode som spesifikt identifiserer en ressurs. MODS - identifier @no
example: General property
modified: 2026-03-12

Language
type: ObjectProperty
domain: Class
  union of: Record (alvin-record)
  union of: Authority
  union of: Variant
  union of: Summary
  union of: MsItem
range: Language
label: Språk @sv
definition: Språk som är kopplat till en resurs eller dess delar. BIBFRAME - language @sv
definition: Language associated with a resource or its parts. BIBFRAME - language
definition: Språk knyttet til en ressurs eller dens deler. BIBFRAME - language @no
example: Language information
modified: 2026-03-12

Level
type: ObjectProperty
domain: Class
  union of: Record (alvin-record)
  union of: Component
range: Level
label: Nivå @sv
definition: Den hierarkiska nivån för materialen som beskrivs av elementet. EAD - archdesc@level @sv
definition: The hierarchical level of the materials being described by the element. EAD - archdesc@level
definition: Det hierarkiske nivået til materialene som beskrives av elementet. EAD - archdesc@level @no
example: General property
modified: 2026-03-12

Music key
type: ObjectProperty
domain: Class
  union of: Record (alvin-record)
  union of: Work
range: MusicKey
label: Tonart @sv
label: Nøkkel @no
definition: Tonhöjd och modus för musik. BIBFRAME - musicKey @sv
definition: Pitch and mode for music. BIBFRAME - musicKey
definition: Tonehøyde og modus for musikk. BIBFRAME - musicKey @no
example: Description information
modified: 2026-03-12

Medium of performance
type: ObjectProperty
domain: Class
  union of: Record (alvin-record)
  union of: Work
range: MusicMedium
label: Besättning @sv
label: Besetning @no
definition: Instrumental, vokal och/eller annat framförandemedium för vilket en musikalisk resurs ursprungligen utformades, skrevs eller framfördes. BIBFRAME - musicMedium @sv
definition: Instrumental, vocal, and/or other medium of performance for which a musical resource was originally conceived, written or performed. BIBFRAME - musicMedium
definition: Instrumental, vokal og/eller annet fremføringsmedium som en musikalsk ressurs opprinnelig ble unnfanget, skrevet eller fremført for. BIBFRAME - musicMedium @no
example: Description information
modified: 2026-03-12

Note
type: ObjectProperty
domain: Class
  union of: Record (alvin-record)
  union of: Work
  union of: Organisation
  union of: Person
  union of: PhysicalLocation
  union of: DateOther
  union of: PhysicalDescription
  union of: MsItem
  union of: Component
range: Note
label: Anmärkning @sv
definition: Information, vanligtvis i textform, om attribut för en resurs eller någon aspekt av en resurs. BIBFRAME - note @sv
definition: Information, usually in textual form, on attributes of a resource or some aspect of a resource. BIBFRAME - note
definition: Informasjon, vanligvis i tekstform, om attributter til en ressurs eller noen aspekter ved en ressurs. BIBFRAME - note @no
example: General property
modified: 2026-03-12

Origin date
type: ObjectProperty
domain: Class
  union of: Record (alvin-record)
  union of: Work
  union of: MsItem
  union of: Component
range: OriginDate
label: Tillkomsttid @sv
label: Tilkomsttid @no
definition: Datum eller datumintervall kopplat till skapandet av ett verk. BIBFRAME - originDate @sv
definition: Date or date range associated with the creation of a work. BIBFRAME - originDate
definition: Dato eller datoperiode knyttet til opprettelsen av et verk. BIBFRAME - originDate @no
example: Origin information
modified: 2026-03-12

Place of publication or production
type: ObjectProperty
domain: Class
  union of: Record (alvin-record)
  union of: Work
  union of: MsItem
range: OriginPlace
label: Utgivnings- eller tillverkningsplats @sv
label: Sted for utgivelse eller produksjon @no
definition: Plats där skapandet av resursen har sitt ursprung. BIBFRAME - originPlace @sv
definition: Place from which the creation of the resource originated. BIBFRAME - originPlace
definition: Stedet hvor ressursen ble opprettet. BIBFRAME - originPlace @no
example: Origin information
modified: 2026-03-12

Other physical description
type: ObjectProperty
domain: Class
  union of: Record (alvin-record)
  union of: MsItem
range: PhysicalDescription
label: Övrig fysisk beskrivning @sv
label: Annen fysisk beskrivelse @no
definition: En behållare för underelement som används för den fysiska beskrivningen av resursen. MODS - physicalDescription @sv
definition: A container element for subelements used for the physical description of the resource. MODS - physicalDescription
definition: En beholder for underelementer som brukes for den fysiske beskrivelsen av ressursen. MODS - physicalDescription @no
example: Carrier information
modified: 2026-03-12

Record information
type: ObjectProperty
domain: Class
  union of: Record (alvin-record)
  union of: Work
  union of: Place
  union of: Person
  union of: Organisation
  union of: Location
range: RecordInfo
label: Postinformation @sv
label: Postinformasjon @no
definition: En behållare som innehåller underelement relaterade till information som är nödvändig för att hantera metadata. MODS - recordInfo @sv
definition: A container element that includes subelements relating to information necessary for managing metadata. MODS - recordInfo
definition: En beholder som inkluderer underelementer relatert til informasjon som er nødvendig for å administrere metadata. MODS - recordInfo @no
example: Administrative information
modified: 2026-03-12

Related record in Alvin
type: ObjectProperty
domain: Class
  union of: Record (alvin-record)
  union of: MsItem
  union of: Component
range: RelatedTo
label: Relaterad post i Alvin @sv
label: Relatert post i Alvin @no
definition: Varje relation med andra poster i Alvin. BIBFRAME - relatedTo @sv
definition: Any relationship with other records in Alvin. BIBFRAME - relatedTo
definition: Ethvert forhold til andre poster i Alvin . BIBFRAME - relatedTo @no
example: Related information
modified: 2026-03-12

Description/summary
type: ObjectProperty
domain: Class
  union of: Record (alvin-record)
  union of: Location
range: Summary
label: Beskrivning/sammanfattning @sv
label: Beskrivelse/sammendrag @no
definition: Sammanfattning eller kort beskrivning av den beskrivna resursen. BIBFRAME - summary @sv
definition: Summary or abstract of the resource described. BIBFRAME - summary
definition: Sammendrag eller kort beskrivelse av ressursen som er beskrevet. BIBFRAME - summary @no
example: General property
modified: 2026-03-12

Title
type: ObjectProperty
domain: Class
  union of: Record (alvin-record)
  union of: Work
  union of: MsItem
  union of: Component
range: Title
label: Titel @sv
label: Tittel @no
definition: Namnet på en resurs. BIBFRAME - title @sv
definition: Name given to a resource. BIBFRAME - title
definition: Navn gitt til en ressurs. BIBFRAME - title @no
example: Title information
modified: 2026-03-12

Variant title
type: ObjectProperty
domain: Class
  union of: Record (alvin-record)
  union of: Work
range: VariantTitle
label: Varianttitel @sv
label: Varianttittel @no
definition: Titel kopplad till resursen som skiljer sig från titeln. BIBFRAME - VariantTitle @sv
definition: Title associated with the resource that is different from the title. BIBFRAME - VariantTitle
definition: Tittel knyttet til ressursen som er forskjellig fra tittelen. BIBFRAME - VariantTitle @no
example: Title information
modified: 2026-03-12

Administrative metadata
type: ObjectProperty
domain: Record (alvin-record)
range: AdminMetadata
label: Administrativ metadata @sv
definition: Metadata om metadata. BIBFRAME - adminMetadata @sv
definition: Metadata about the metadata. BIBFRAME - adminMetadata
definition: Metadata om metadataene. BIBFRAME - adminMetadata @no
example: Administrative information
modified: 2026-03-12

Technique
type: ObjectProperty
domain: Record (alvin-record)
range: AppliedMaterial
label: Teknik @sv
label: Teknikk @no
definition: Fysiskt eller kemiskt ämne applicerat på ett basmaterial av en resurs. BIBFRAME - AppliedMaterial @sv
definition: Physical or chemical substance applied to a base material of a resource. BIBFRAME - AppliedMaterial
definition: Fysisk eller kjemisk stoff påført et grunnmateriale av en ressurs. BIBFRAME - AppliedMaterial @no
example: Carrier information
modified: 2026-03-12

Value
type: ObjectProperty
domain: Record (alvin-record)
range: Appraisal
label: Valör @sv
label: Verdi @no
definition: Valören för objektet. NUDS - appraisal @sv
definition: The appraisal of the object. NUDS - appraisal
definition: Vurdering av objektet. NUDS - appraisal @no
example: Description information
modified: 2026-03-12

Axis
type: ObjectProperty
domain: Record (alvin-record)
range: Axis
label: Stampställning @sv
label: Stampstilling @no
definition: Orienteringen av åtsidan till frånsidan. NUDS - axis @sv
definition: The orientation of the obverse to the reverse. NUDS - axis
definition: Orienteringen av forsiden til baksiden. NUDS - axis @no
example: Description information
modified: 2026-03-12

Material
type: ObjectProperty
domain: Record (alvin-record)
range: BaseMaterial
label: Materiale @no
definition: Underliggande fysiskt material för en resurs. BIBFRAME - BaseMaterial @sv
definition: Underlying physical material of a resource. BIBFRAME - BaseMaterial
definition: Underliggende fysisk materiale til en ressurs. BIBFRAME - BaseMaterial @no
example: Carrier information
modified: 2026-03-12

Book binding
type: ObjectProperty
domain: Record (alvin-record)
range: BindingDesc
label: Bokband @sv
label: Bokbind @no
definition: Beskriver nuvarande och tidigare bindningar av ett manuskript eller annat föremål. TEI - bindingDesc @sv
definition: Describes the present and former bindings of a manuscript or other object. TEI - bindingDesc
definition: Beskriver nåværende og tidligere bindinger av et manuskript eller annen gjenstand. TEI - bindingDesc @no
example: Description information
modified: 2026-03-12

Cartographic data
type: ObjectProperty
domain: Record (alvin-record)
range: CartographicAttributes
label: Kartografiska data @sv
label: Kartografiske data @no
definition: Kartografiska data som identifierar egenskaper hos resursen, såsom koordinater, projektion, etc. BIBFRAME - cartographicAttributes @sv
definition: Cartographic data that identifies characteristics of the resource, such as coordinates, projection, etc. BIBFRAME - cartographicAttributes
definition: Kartografiske data som identifiserer egenskapene til ressursen, som koordinater, projeksjon osv. BIBFRAME - cartographicAttributes @no
example: Description information
modified: 2026-03-12

Classification
type: ObjectProperty
domain: Record (alvin-record)
range: Classification
label: Klassifikation @sv
label: Klassifisering @no
definition: Klassificeringsnummer i valfritt schema. BIBFRAME - classification @sv
definition: Classification number in any scheme. BIBFRAME - classification
definition: Klassifikasjonsnummer i ethvert skjema. BIBFRAME - classification @no
example: Subject term, category and classification information
modified: 2026-03-12

Collection
type: ObjectProperty
domain: Record (alvin-record)
range: Collection
label: Samling @sv
definition: En sammansatt grupp av föremål som inte ursprungligen publicerades, distribuerades eller producerades tillsammans. MODS - typeOfResource/@collection @sv
definition: A made-up multipart group of items that were not originally published, distributed, or produced together. MODS - typeOfResource/@collection
definition: En sammensatt gruppe av gjenstander som ikke opprinnelig ble publisert, distribuert eller produsert sammen. MODS - typeOfResource/@collection @no
example: General property
modified: 2026-03-12

Conservation state
type: ObjectProperty
domain: Record (alvin-record)
range: ConservationState
label: Kondition @sv
label: Konservasjonstilstand @no
definition: De fysiska tillstånden för bevarande av ett föremål. NUDS - conservationState @sv
definition: The physical states of conservation of an object. NUDS - conservationState
definition: De fysiske tilstandene for bevaring av et objekt. NUDS - conservationState @no
example: Description information
modified: 2026-03-12

Subordinate components
type: ObjectProperty
domain: Record (alvin-record)
range: DescriptionOfSubordinateComponents
label: Underordnade komponenter @sv
label: Underordnede komponenter @no
definition: Ett containerelement som samlar information om de hierarkiska grupperingarna av materialet som beskrivs. EAD - dsc @sv
definition: A wrapper element that bundles information about the hierarchical groupings of the materials being described. EAD - dsc
definition: Et beholderelement som samler informasjon om de hierarkiske grupperingene til materialet som beskrives. EAD - dsc @no
example: General property
modified: 2026-03-12

Measure
type: ObjectProperty
domain: Record (alvin-record)
range: Dimensions
label: Mått @sv
label: Mål @no
definition: Mått på bäraren eller bärarna och/eller behållaren för en resurs. BIBFRAME - dimensions @sv
definition: Measurements of the carrier or carriers and/or the container of a resource. BIBFRAME - dimensions
definition: Dimensjoner på bæreren eller bærerne og/eller beholderen til en ressurs. BIBFRAME - dimensions @no
example: Carrier information
modified: 2026-03-12

Edge description
type: ObjectProperty
domain: Record (alvin-record)
range: Edge
label: Randtyp @sv
label: Randbeskrivelse @no
definition: Ett containerelement för metadata om kanten. NUDS - edge @sv
definition: A container element for metadata about the edge. NUDS - edge
definition: Et beholderelement for metadata om kanten. NUDS - edge @no
example: Description information
modified: 2026-03-12

Files
type: ObjectProperty
domain: Record (alvin-record)
range: FileSection
label: Filer @sv
definition: Filsektionen innehåller ett eller flera fileGroup-element som används för att gruppera relaterade filer. METS - fileSec @sv
definition: The file section contains one or more fileGroup elements used to group together related files. METS - fileSec
definition: Fildelen inneholder ett eller flere fileGroup-elementer som brukes til å gruppere relaterte filer. METS - fileSec @no
example: File information
modified: 2026-03-12

Weight
type: ObjectProperty
domain: Record (alvin-record)
range: Measure
label: Vikt @sv
label: Vekt @no
definition: Ett ord eller en fras som hänvisar till någon kvantitet av ett föremål eller en vara, vanligtvis bestående av ett nummer, en enhet och ett namn. TEI - measure @sv
definition: A word or phrase referring to some quantity of an object or commodity, usually comprising a number, a unit, and a commodity name. TEI - measure
definition: Et ord eller en setning som refererer til en viss mengde av en gjenstand eller vare, vanligvis bestående av et tall, en enhet og et navn. TEI - measure @no
example: Carrier information
modified: 2026-03-12

Contents (manuscript)
type: ObjectProperty
domain: Record (alvin-record)
range: MsContents
label: Innehåll (handskrift) @sv
label: Innhold (manuskript) @no
definition: Beskriver det intellektuella innehållet i ett manuskript, en manuskriptdel eller annat objekt antingen som en serie stycken eller som en serie strukturerade manuskriptdelar. TEI - msContents @sv
definition: Describes the intellectual content of a manuscript, manuscript part, or other object either as a series of paragraphs or as a series of structured manuscript items. TEI - msContents
definition: Beskriver det intellektuelle innholdet i et manuskript, en manuskriptdel eller et annet objekt enten som en serie avsnitt eller som en serie strukturerte manuskriptelementer. TEI - msContents @no
example: General property
modified: 2026-03-12

Notation
type: ObjectProperty
domain: Record (alvin-record)
range: MusicNotation
label: Notationssätt @sv
label: Notasjon @no
definition: Information om symbolsystemet som används för att förmedla innehållet i en musikresurs. BIBFRAME - MusicNotation @sv
definition: Information on the symbol system used to convey the content of a music resource. BIBFRAME - MusicNotation
definition: nformasjon om symbolsystemet som brukes til å formidle innholdet i en musikkressurs. BIBFRAME - MusicNotation @no
example: Description information
modified: 2026-03-12

Obverse
type: ObjectProperty
domain: Record (alvin-record)
range: Obverse
label: Åtsida @sv
label: Advers @no
definition: För kodning av typologiska attribut på åtsidan av ett mynt. NUDS - obverse @sv
definition: For encoding typological attributes about the obverse of a coin. NUDS - obverse
definition: For koding av typologiske attributter på forsiden av en mynt. NUDS - obverse @no
example: Description information
modified: 2026-03-12

Physical location
type: ObjectProperty
domain: Record (alvin-record)
range: PhysicalLocation
label: Fysisk placering @sv
label: Fysisk plassering @no
definition: Identifierar organisationen som äger objektet eller från vilket det är tillgängligt. Kan också innehålla detaljerad information om hur man hittar föremålet i en samling. MARC21 - 852 @sv
definition: Identifies the organization holding the item or from which it is available. May also contain detailed information about how to locate the item in a collection. MARC21 - 852
definition: Identifiserer organisasjonen som eier objektet eller som det er tilgjengelig fra. Kan også inneholde detaljert informasjon om hvordan du finner gjenstanden i en samling. MARC21 - 852 @no
example: Location information
modified: 2026-03-12

Production method
type: ObjectProperty
domain: Record (alvin-record)
range: ProductionMethod
label: Produktionsmetod @sv
label: Produksjonsmetode @no
definition: Process som används för att producera en resurs. BIBFRAME - productionMethod @sv
definition: Process used to produce a resource. BIBFRAME - productionMethod
definition: Prosess som brukes til å produsere en ressurs. BIBFRAME - productionMethod @no
example: General property
modified: 2026-03-12

Reverse
type: ObjectProperty
domain: Record (alvin-record)
range: Reverse
label: Frånsida @sv
label: Revers @no
definition: För kodning av typologiska attribut på frånsidan av ett mynt. NUDS - reverse @sv
definition: For encoding typological attributes about the reverse of a coin. NUDS - reverse
definition: For koding av typologiske attributter om baksiden av en mynt. NUDS - reverse @no
example: Description information
modified: 2026-03-12

Subject
type: ObjectProperty
domain: Record (alvin-record)
range: Subject
label: Ämnesord @sv
label: Emneord @no
definition: Ämnesord som beskriver en resurs. BIBFRAME - subject. @sv
definition: Subject term(s) describing a resource. BIBFRAME - subject.
definition: Emneord som beskriver en ressurs. BIBFRAME - subject. @no
example: Subject term, category and classification information
modified: 2026-03-12

Resource type
type: ObjectProperty
domain: Record (alvin-record)
range: TypeOfResource
label: Resurstyp @sv
label: Ressurstype @no
definition: En term som specificerar egenskaperna och den allmänna typen av innehåll för resursen. MODS - typeOfResource @sv
definition: A term that specifies the characteristics and general type of content of the resource. MODS - typeOfResource
definition: Et begrep som spesifiserer egenskapene og den generelle typen innhold til ressursen. MODS - typeOfResource @no
example: Subject term, category and classification information
modified: 2026-03-12

Work
type: ObjectProperty
domain: Record (alvin-record)
range: Work
label: Verk @sv
definition: Länk till auktoritetspost för verk. @sv
definition: Link to an authority record for a work.
definition: Link til autoritetspost for verk. @no
example: Related information
modified: 2026-03-12

Terms of use and access
type: DatatypeProperty
domain: Class
  union of: Record (alvin-record)
  union of: Component
range: Literal
label: Villkor för användning och åtkomst @sv
label: Vilkår for bruk og tilgang @no
definition: Åtkomstbegränsningar och tillstånd avseende tillgång till en resurs, t.ex. utlåningspolicy, åtkomstbegränsningar, embargon. BIBFRAME - AccessPolicy @sv
definition: Access restrictions and allowances regarding access to a resource, e.g., lending policy, access restrictions, embargos. BIBFRAME - AccessPolicy
definition: Tilgangsbegrensninger og tillatelser angående tilgang til en ressurs, for eksempel utlånspolitikk, tilgangsbegrensninger, embargoer. BIBFRAME - AccessPolicy @no
example: Description information
modified: 2026-03-12

Decoration
type: DatatypeProperty
domain: Class
  union of: Record (alvin-record)
  union of: BindingDesc
range: Literal
label: Dekor @sv
label: Dekorasjon @no
definition: Innehåller en anmärkning som beskriver antingen en dekorativ komponent eller en ganska homogen klass av sådana komponenter. TEI - decoNote @sv
definition: Contains a note describing either a decorative component, or a fairly homogenous class of such components. TEI - decoNote
definition: Inneholder en note som beskriver enten en dekorativ komponent, eller en ganske homogen klasse av slike komponenter. TEI - decoNote @no
example: Description information
modified: 2026-03-12

Explicit
type: DatatypeProperty
domain: Class
  union of: Record (alvin-record)
  union of: MsItem
range: Literal
label: Explicit (avslutande ord) @sv
label: Explicit (avsluttende ord) @no
definition: Innehåller de avslutande orden i själva texten, exklusive någon rubrik eller kolofon som kan följa den. TEI - explicit @sv
definition: Contains the explicit of a item, that is, the closing words of the text proper, exclusive of any rubric or colophon which might follow it. TEI - explicit
definition: Inneholder de avsluttende ordene i selve teksten, unntatt enhver rubrikk eller kolofon som kan følge den. TEI - explicit @no
example: Description information
modified: 2026-03-12

Extent
type: DatatypeProperty
domain: Class
  union of: Record (alvin-record)
  union of: Component
range: Literal
label: Omfång @sv
label: Omfang @no
definition: Antal och typ av enheter och/eller underenheter som utgör en resurs. BIBFRAME - extent @sv
definition: Number and type of units and/or subunits making up a resource. BIBFRAME - extent
definition: Antall og type enheter og/eller underenheter som utgjør en ressurs. BIBFRAME - extent @no
example: Carrier information
modified: 2026-03-12

Final rubric
type: DatatypeProperty
domain: Class
  union of: Record (alvin-record)
  union of: MsItem
range: Literal
label: Final rubric (slut på textavsnitt) @sv
label: Final rubric (slutten av en tekstdel) @no
definition: Innehåller den sträng av ord som betecknar slutet av en textindelning, ofta med ett påstående om dess författare och titel, vanligtvis avvikande från själva texten med rött bläck, av en annan storlek eller typ av skrift, eller av någon annan sådan visuell effekt. TEI - finalRubric @sv
definition: Contains the string of words that denotes the end of a text division, often with an assertion as to its author and title, usually set off from the text itself by red ink, by a different size or type of script, or by some other such visual device. TEI - finalRubric
definition: Inneholder strengen av ord som betegner slutten av en tekstinndeling, ofte med en påstand om forfatteren og tittelen, vanligvis satt av fra selve teksten med rødt blekk, av en annen størrelse eller type skrift, eller av en annen slik visuell effekt. TEI - finalRubric @no
example: Location information
modified: 2026-03-12

Incipit
type: DatatypeProperty
domain: Class
  union of: Record (alvin-record)
  union of: Work
  union of: MsItem
range: Literal
label: Incipit (inledande ord) @sv
label: Incipit (innledende ord) @no
definition: Innehåller inledningen av ett manuskript eller liknande föremål, det vill säga inledningsorden i själva texten, exklusive någon rubrik som kan föregå den, av tillräcklig längd för att identifiera verket unikt. TEI - incipit @sv
definition: Contains the incipit of a manuscript or similar object item, that is the opening words of the text proper, exclusive of any rubric which might precede it, of sufficient length to identify the work uniquely; such incipits were, in former times, frequently used a means of reference to a work, in place of a title. TEI - incipit
definition: Inneholder innledningen til et manuskript eller lignende gjenstand, det vil si åpningsordene i teksten, unntatt enhver rubrikk som kan komme foran den, av tilstrekkelig lengde til å identifisere verket unikt. TEI - incipit @no
example: Description information
modified: 2026-03-12

Literature
type: DatatypeProperty
domain: Class
  union of: Record (alvin-record)
  union of: Work
  union of: MsItem
range: Literal
label: Litteratur @sv
definition: (Citeringslista) innehåller en lista över bibliografiska referenser av något slag. TEI - listBibl @sv
definition: (Citation list) contains a list of bibliographic citations of any kind. TEI - listBibl
definition: (Siteringsliste) inneholder en liste over bibliografiske referanser av noe slag. TEI - listeBibl @no
example: Description information
modified: 2026-03-12

Locus
type: DatatypeProperty
domain: Class
  union of: Record (alvin-record)
  union of: MsItem
range: Literal
definition: Definierar en plats i ett manuskript, en manuskriptdel eller annat objekt, vanligtvis som en (möjligen diskontinuerlig) sekvens av folioreferenser. TEI - locus @sv
definition: Defines a location within a manuscript, manuscript part, or other object typically as a (possibly discontinuous) sequence of folio references. TEI - locus
definition: Definerer en plassering i et manuskript, en manuskriptdel eller et annet objekt, vanligvis som en (muligens diskontinuerlig) sekvens av folioreferanser. TEI - locus @no
example: Carrier information
modified: 2026-03-12

Rubric
type: DatatypeProperty
domain: Class
  union of: Record (alvin-record)
  union of: MsItem
range: Literal
label: Rubric (rubrik, början av textavsnitt) @sv
label: Rubric (overskrift, begynnelsen av tekstdelen) @no
definition: Innehåller texten till valfri rubrik eller rubrik som är kopplad till ett visst manuskriptobjekt, det vill säga en rad ord genom vilka ett manuskript eller annat objekt signalerar början på en textdel, ofta med ett påstående om dess författare och titel, som på något sätt avviker från själva texten, vanligtvis med rött bläck, eller genom att använda olika storlek eller typ av skrift, eller någon annan sådan visuell effekt. TEI - rubric @sv
definition: Contains the text of any rubric or heading attached to a particular manuscript item, that is, a string of words through which a manuscript or other object signals the beginning of a text division, often with an assertion as to its author and title, which is in some way set off from the text itself, typically in red ink, or by use of different size or type of script, or some other such visual device. TEI - rubric
definition: Inneholder teksten til en hvilken som helst tittel eller tittel knyttet til et bestemt manuskriptobjekt, det vil si en rekke ord som et manuskript eller annet objekt signaliserer begynnelsen på en tekstdel, ofte med en uttalelse om forfatteren og tittelen, som i noen måte avviker fra selve teksten, vanligvis med rødt blekk, eller ved å bruke en annen størrelse eller type skrift, eller en annen slik visuell effekt. TEI - rubric @no
example: Description information
modified: 2026-03-12

Accruals
type: DatatypeProperty
domain: Record (alvin-record)
range: Literal
label: Tillväxt @sv
label: Tilvekst @no
definition: Ett element för information om förväntade tillägg till de material som beskrivs. EAD - accruals @sv
definition: An element for information about anticipated additions to the materials being described. EAD - accruals
definition: Et element for informasjon om forventede tillegg til materialene som beskrives. EAD - accruals @no
example: Description information
modified: 2026-03-12

Arrangement
type: DatatypeProperty
domain: Record (alvin-record)
range: Literal
label: Struktur @sv
label: Ordning @no
definition: Ett element för att beskriva organisationen eller arkiveringsföljden för handlingarna. EAD - arrangement @sv
definition: An element for describing the organisation or filing sequence of the records. EAD - arrangement
definition: Et element for å beskrive organiseringen eller arkiveringssekvensen til dokumentene. EAD - arrangement @no
example: Description information
modified: 2026-03-12

Countermark
type: DatatypeProperty
domain: Record (alvin-record)
range: Literal
label: Kontramarkering @sv
label: Kontramerke @no
definition: En fysisk egenskap, skild från typologisk beskrivning. NUDS - countermark @sv
definition: A physical characteristic, separated from typological description. NUDS - countermark
definition: En fysisk karakteristikk, atskilt fra typologisk beskrivelse. @no
example: Description information
modified: 2026-03-12

Edition
type: DatatypeProperty
domain: Record (alvin-record)
range: Literal
label: Utgåva/upplaga @sv
label: Utgave @no
definition: Information som identifierar utgåvan eller versionen av resursen och tillhörande ansvarsförklaringar för utgåvan; vanligtvis transkriberat. BIBFRAME - editionStatement @sv
definition: Information identifying the edition or version of the resource and associated statements of responsibility for the edition; usually transcribed. BIBFRAME - editionStatement
definition: Informasjon som identifiserer utgaven eller versjonen av ressursen og tilhørende ansvarserklæringer for utgaven; vanligvis transkribert. BIBFRAME - editionStatement @no
example: Description information
modified: 2026-03-12

Other finding aids
type: DatatypeProperty
domain: Record (alvin-record)
range: Literal
label: Andra sökhjälpmedel @sv
label: Andre fremfinningsverktøy @no
definition: För att identifiera andra hjälpmedel för att hitta materialet som beskrivs. EAD - otherfindaid @sv
definition: For identifying any other finding aids to the materials being described. EAD - otherfindaid
definition: For å identifisere eventuelle andre hjelpemidler til materialene som beskrives. EAD - otherfindaid @no
example: Description information
modified: 2026-03-12

Publication (publisher, imprint)
type: DatatypeProperty
domain: Record (alvin-record)
range: Literal
label: Utgivning (förlag, impressum) @sv
label: Utgivelse (forlag, imprint) @no
definition: Information om publicering av en resurs. BIBFRAME - Publication @sv
definition: Information relating to publication of a resource. BIBFRAME - Publication
definition: Informasjon knyttet til publisering av en ressurs. BIBFRAME - Publication @no
example: Description information
modified: 2026-03-12

Related archives outside Alvin
type: DatatypeProperty
domain: Record (alvin-record)
range: Literal
label: Relaterade arkiv utanför Alvin @sv
label: Relaterte arkiver utenfor Alvin @no
definition: För att identifiera arkivmaterial som har en koppling till det material som beskrivs. EAD - relaterat material @sv
definition: For identifying archival materials that have an association to the materials being described. EAD - relatedmaterial
definition: For å identifisere arkivmateriale som har en assosiasjon til materialene som beskrives. EAD - relatedmaterial @no
example: Description information
modified: 2026-03-12

Table of contents
type: DatatypeProperty
domain: Record (alvin-record)
range: Literal
label: Innehållsförteckning @sv
label: Innholdsfortegnelse @no
definition: Innehållsförteckning för den beskrivna resursen. BIBFRAME - tableOfContents @sv
definition: Table of contents of the described resource. BIBFRAME - tableOfContents
definition: Innholdsfortegnelse for den beskrevne ressursen. BIBFRAME - tableOfContents @no
example: Description information
modified: 2026-03-12

Transcription
type: DatatypeProperty
domain: Record (alvin-record)
range: Literal
label: Transkription @sv
label: Transkripsjon @no
definition: En transkription av ett källdokument. TEI - sourceDoc @sv
definition: A transcription of a single source document. TEI - sourceDoc
definition: En transkripsjon av et kildedokument. TEI - sourceDoc @no
example: Description information
modified: 2026-03-12

Weeding
type: DatatypeProperty
domain: Record (alvin-record)
range: Literal
label: Gallring @sv
label: Arkivrydding @no
definition: Ett element för att dokumentera beslut och handlingar relaterade till bedömning av arkivvärde och disposition av det material som beskrivs. EAD - appraisal @sv
definition: An element for documenting decisions and actions related to assessing the archival value and disposition of the materials being described. EAD - appraisal
definition: Et element for å dokumentere beslutninger og handlinger knyttet til vurdering av arkivverdi og disponering av materialene som beskrives. EAD - appraisal @no
example: Description information
modified: 2026-03-12